{"text_format":"1","workbook":"xlsx","n_sheets":4,"sheets":["General Information","Questions","Non Conformances","Guidance"],"not_rendered":{"charts":0,"images":3,"macros":1,"external_links":0,"defined_names":7,"comments":0,"pivot_tables":0},"unopened":[],"bounds":{"document_bytes":16777216,"sheet_cells":100000,"rows_first":2000,"rows_last":500,"rows_between":2000,"halvings":0,"cell_chars":16384,"cell_head_chars":4096},"cells_cut":0,"cells_raw":0,"read":"whole","date_system":"1900"}

{"sheet":"General Information","index":0,"n_rows":46,"n_cols":26,"rows_kept":46,"cut":false,"hidden":false,"merged":[[33,2,33,4],[23,2,23,4],[15,2,15,4],[16,2,16,4],[10,2,10,4],[11,2,11,4],[12,2,12,4],[43,1,43,4],[6,2,6,4],[7,2,7,4],[8,2,8,4],[19,2,19,4],[34,1,34,4],[22,1,22,4],[21,2,21,4],[26,2,26,4],[27,2,27,4],[24,2,24,4],[25,2,25,4],[28,2,28,4],[45,1,45,4],[44,1,44,4],[5,2,5,4],[0,2,0,4],[1,1,1,4],[32,2,32,4],[29,1,29,4],[17,2,17,4],[18,2,18,4],[20,2,20,4],[13,2,13,4],[14,2,14,4],[2,2,2,4],[3,2,3,4],[4,2,4,4],[9,2,9,4]]}
[null,null,"Costco Addendum V3.0"]
[null,"General Information"]
[null,"Supplier Name:"]
[null,"Facility Name:"]
[null,"Street Address:"]
[null,"City:"]
[null,"State/Province:"]
[null,"Country:"]
[null,"Postal Code:"]
[null,"Facility Contact Name:"]
[null,"Title:"]
[null,"Email:"]
[null,"Phone:"]
[null,"EFA Request Number:"]
[null,"Audit Type:",{"$f":"C1","v":"Costco Addendum V3.0"}]
[null,"Auditor Name:"]
[null,"Audit Company:"]
[null,"Audit Dates:"]
[null,"Announced? (Yes/No):"]
[null,"Total Number of Hours On Site:"]
{"$rows_left_out":27}
{"sheet":"Questions","index":1,"n_rows":16,"n_cols":10,"rows_kept":16,"cut":false,"hidden":false,"merged":[]}
[null,null,{"$f":"'General Information'!C15:E15 & \" - Questions \"","v":"Costco Addendum V3.0 - Questions "},null,null,null,null,"Awarded","Possible","Criticals"]
["Section Name ","Section #","Question Text","Allowable Answers","Answer","Notes\n(required for a score of 4, 3, 2, 1, 0, N/A, or where noted)"]
["Addendum Questions"]
["Supplier Approval Program","3.1.1","\nOperations must have a Supplier Approval Program in place to monitor and evaluate all raw material (including primary packaging) suppliers. \n\nThe Supplier Approval Program shall at a minimum include:\n\n- A requirement for suppliers to be audited by a third party to a standard that verifies implementation of GMP/GDP/GAP, HACCP/Preventive Controls/HARA, a traceability system, and a recall management plan. The requirements shall have pass/fail criteria defined for the supplier’s audits to maintain approved status.\n\n- Annual verification of the supplier’s audit e.g. confirming the supplier passed their annual audit. \n\n- Where there are label claims such as “organic”, “Gluten Free”, “non-GMO”, ”no antibiotics”, “raised without antibiotics”, ”no hormones added”, or ”no hormones administered” the operation must validate these through any combination of testing, certifications, or audits.\n","5, 4, 3, 2, 1, 0, N/A",null,null,null,{"$f":"E4","v":0},{"$f":"IF(E4=\"N/A\",0,5)","v":5},0]
["Foreign Material Control\n","3.1.2","\nOperations must have a comprehensive foreign material control plan in place for known and reasonably foreseeable physical hazards. In addition to GFSI requirements the foreign material control plan at a minimum must include:\n\n- A policy that restricts the use of materials in product zones and areas that are not easily cleanable or prone to creating foreign material contamination. These materials include - but\nare not limited to - foam rubber, any type of carpet, wood, non-food grade plastic, cardboard, tape, etc. Clothes, towels, and other cleaning materials that pose a risk of contamination or adulteration shall not be used to remove dirt and debris from products.\nWorkers must not handle products in a manner that results in contamination or adulteration.\n\n- A mechanism for employees to report concerns that includes specific language for foreign material contamination.\n\n- Annual training on foreign material hazards for all employees at the facility, including instruction on the mechanism employees can use to report concerns\n","5, 4, 3, 2, 1, 0, N/A",null,null,null,0,{"$f":"IF(E5=\"N/A\",0,5)","v":5},0]
["Foreign Material Control\n","3.1.3","\nAll manufacturing operations must have a foreign material detection system (metal detection, x-ray, sieves, optical sorter etc.) installed, selecting the most effective solutions available for their products and processes. Suppliers must justify their choice with documented scientific and technical evidence that proves the system’s effectiveness in reducing contamination, citing sources like expert recommendations, scientific literature, regulatory guidance, and validation studies:\n\n- Shell Eggs, whole raw agricultural commodities, whole roasted coffee beans, whole muscle meats, whole or portioned in shell crab; whole lobster tails, Whole, eviscerated fish, hand portioned fish fillets and peeled/de-headed shrimp, and packaging products will be exempt from the foreign material device requirement. The operation will need to maintain current good manufacturing practices and prerequisite programs to mitigate foreign material contamination.\n\n- Operations that utilize a physical barrier (e.g. screen, filter, sieve) that's appropriately sized and placed just prior to packaging will be exempt from the foreign material device requirement. The operation will need to conduct integrity checks at a defined frequency, and maintain current good manufacturing practices and prerequisite programs to mitigate foreign material contamination.\n","5, 4, 3, 2, 1, 0, N/A",null,"Please describe the FM system(s) in use and justification for effectiveness.",null,0,5,0]
["Foreign Material Control\n","3.1.4","\nAll foreign material devices must have a proper rejection mechanism to segregate rejected products. Rejected products must be physically segregated and have access restricted until evaluation by designated personnel can be completed. \n\nOperations must perform documented foreign material detection challenges at a defined frequency, but at a minimum: \n\n- At the start and finish of daily production/shift.\n- At ≤ 2 (two) hour intervals during the production run.\n- When changes in production batches occur.\n- When changes in machine settings occur.\n- After downtime for repairs.\n","5, 4, 3, 2, 1, 0, N/A",null,null,null,0,5,0]
["Product Traceability","3.1.5","\nCostco requires that suppliers show that traceability exercises were conducted independently at least twice during the year. The system must be able to account for 100% of the product in a 2-hour timeframe. Site must show that they have conducted separate trace exercises for two of the three areas defined in the Costco requirements:\n- Finished goods\n- Raw material/ingredients\n- Primary packaging\n\nThe third area should be the subject of the onsite auditor-initiated trace exercise. Each exercise must be completed within a 2-hour limit and account for 100% of the selected sample. \n","5, 4, 3, 2, 1, 0, N/A",null,"Please describe the auditor-initiated trace exercise and summarize the results.",null,0,5,0]
["Product Traceability","3.1.6","\nFor finished food products that are shipped to an intermediary facility prior to delivery to a Costco depot or warehouse, the following mock recall requirements apply:\n\n• Annual Mock Recall:\n- Suppliers must conduct an annual mock recall exercise.\n- This exercise must verify the accuracy of current contact information for the intermediary facility and confirm that the quantities of product received and distributed by the intermediary facility match the supplier's production and distribution records of a selected lot code.\n- Evidence of communication with the intermediary facility, including verification of contact information and quantity reconciliation to the specific lot code, must be documented.\n\n• Direct Shipment Exclusion:\n- Suppliers shipping finished food products directly to a Costco depot or warehouse are exempt from these intermediary facility-specific mock recall requirements.\n","5, 4, 3, 2, 1, 0, N/A",null,null,null,0,5,0]
["Allergen Control","3.1.7","\nAll operations must have a documented allergen control policy in place.\n\nSuppliers must have documented procedures to ensure the accuracy of allergen labeling.  These procedures must include documented verification of labels against a control to ensure the correct label is used on each product, and that the allergen declarations are accurate for the intended market. Label verification must be performed on labels upon receipt, on each batch of labels used in production, as part of any product changeovers, and on each lot of finished product prior to shipment.\n\n","5, 4, 3, 2, 1, 0, N/A",null,null,null,0,5,0]
["Microbiological Testing","3.1.8","\nSuppliers of high risk ready-to-eat (RTE) food items, as well as some high risk not-ready-to-eat (NRTE) food items, must have a documented Finished Goods Test and Hold Program to detect hazards of concern. Refer to the Audit Expectations - Appendix II for Costco's definition of High Risk and additional guidelines.\n\nTest and hold program requirements:\n- Science-based sampling plan\n- Developed and maintained by or under the consultation of a competent person\n- Designed to detect the hazard of concern\n- Performed on all Costco Wholesale production lots.\n- Sample size and frequency shall be defined and adequately represent the production lots\n- For products subject to the Test and Hold Program, all product lots must remain within the supplier's control until satisfactory test results are obtained.\n\nAdditionally, all finished product lots that undergo pathogen testing voluntarily, at buyer’s request, as required in product specifications, or due to regulatory requirements must remain within the supplier's control until satisfactory test results are obtained.\n","5, 4, 3, 2, 1, 0, N/A",null,null,{"$f":"HYPERLINK(\"#Guidance!A30\", \"Appendix II\")","v":"Appendix II"},0,5,0]
["Microbiological Testing\n","3.1.9","\nAll operations must have a written program in place to verify sanitation effectiveness for food contact surfaces. The program should be based on a risk assessment of the operation and validated, and shall not rely solely on visual checks for sanitation verification. Examples of acceptable verification include ATP monitoring or swabbing for TPC (Total Plate Count).\n","5, 4, 3, 2, 1, 0, N/A",null,null,null,0,5,0]
["Microbiological Testing\n","3.1.10","\nAll operations must have a written Environmental Monitoring program in place to assess sanitation effectiveness. The program must be based on a risk assessment of the operation and its effectiveness must be re-evaluated when deficiencies are identified, or at least on an annual basis.\n\nSuppliers of high risk, ready-to-eat food items (including frozen produce and fresh produce where water is introduced) should have the following included in their Environmental Monitoring Programs:\n• Sampling protocol - including frequency, number of samples, sample locations, and methodology for each target organism.\n• Acceptance/Rejection criteria, including acceptable critical limits\n• Evaluation and trending of results.\n• Corrective action procedures, with proposed follow-up and/or corrective actions for unsatisfactory results.\n\nWhere pathogen testing is done on food contact surfaces, all product lots processed over the swabbed surface(s) since the last validated sanitation cycle shall remain within the supplier's control until satisfactory test results are obtained.\n","5, 4, 3, 2, 1, 0, N/A",null,null,null,0,5,0]
["Personnel Hygiene\n","3.1.11","\nAll persons must wear single use hairnet/facial hair coverings when around exposed products, regardless of risk level. \n- Beards or mustaches must be fully covered by a facial hair covering. \n- Caps are not an adequate hair cover or hair restraint, and will require a hairnet to be worn underneath. Caps must be clean and shall not pose a risk of contamination. Caps that are made of a material that is not easily cleanable must be covered by a hair net.\n","5, 4, 3, 2, 1, 0, N/A",null,null,null,0,5,0]
["Personnel Hygiene\n","3.1.12","\nCostco has a \"no bare hands\" policy for ready to eat foods i.e. gloves must be used where there is a direct hand contact with ready-to-eat products regardless of risk level. The facility must have a written procedure for the proper handling and usage of gloves and must include verification documentation.\n\n- Reusable food-safe gloves must be washed and sanitized frequently – at a minimum, at the start, after breaks, and after handling potential contaminants. \n- If fabric gloves are used when hands are in contact with food, they need to be covered with an outer latex-free, powder-free disposable glove. \n- Single use gloves are to be latex-free and powder-free, maintained intact, clean, and in good condition. \n\n","5, 4, 3, 2, 1, 0, N/A",null,null,null,0,5,0]
["\nPet Food Only\nIrradiation","3.1.13","\nFor Pet Food Only\nWith the exception of products that are extruded, chopped, formed, and cooked to the appropriate temperature under a verified preventive measures plan, as well as any of the formulated biscuit style treats that are baked, Costco requires that all whole muscle dog treats (chicken jerky, pig ears, pizzles, fish jerky, etc.) and imported dog treats (all styles) shall be irradiated. Per Australian Standards for pet food, if the product has been irradiated, the label must include the statement - \"Must be not fed to cats\"\n","5, 4, 3, 2, 1, 0, N/A",null,null,null,0,5,0]

{"sheet":"Non Conformances","index":2,"n_rows":27,"n_cols":9,"rows_kept":27,"cut":false,"hidden":false,"merged":[[5,4,8,4],[5,5,8,5],[2,4,4,4],[2,5,4,5],[0,0,0,4],[1,0,1,1],[1,2,1,3],[1,4,1,5]]}
["Corrective Action Plan"]
["Facility Information",null,"Audit Information",null,"CAP Information",null,null,"Review Status"]
["Supplier:",{"$f":"IFERROR(('General Information'!C3 &\"\"),\"\")","v":""},"EFA Request #",{"$f":"IFERROR(('General Information'!C14 &\"\"),\"\")","v":""},"Total Findings",{"$f":"SUM(COUNTIFS(Questions!E4:E16,{\"<5\",\"=No\"}))","v":0},null,"Approved"]
["Facility:",{"$f":"IFERROR(('General Information'!C4 &\"\"),\"\")","v":""},"Audit Type:",{"$f":"IFERROR(('General Information'!C15 &\"\"),\"\")","v":"Costco Addendum V3.0"},null,null,null,"In Process"]
["Address:",{"$f":"IFERROR(('General Information'!C5 &\"\"),\"\")","v":""},"Auditor:",{"$f":"IFERROR(('General Information'!C16 &\"\"),\"\")","v":""},null,null,null,"Rejected"]
["Contact:",{"$f":"IFERROR(('General Information'!C10 &\"\"),\"\")","v":""},null,null,"Status"]
["Title:",{"$f":"IFERROR(('General Information'!C11 &\"\"),\"\")","v":""},"Audit Company",{"$f":"IFERROR(('General Information'!C17 &\"\"),\"\")","v":""}]
["Email:",{"$f":"IFERROR(('General Information'!C12 &\"\"),\"\")","v":""},"Audit Date(s)",{"$f":"IFERROR(('General Information'!C18 &\"\"),\"\")","v":""}]
["Phone:",{"$f":"IFERROR(('General Information'!C13 &\"\"),\"\")","v":""}]
[]
["Below are the non-conformances that have been identified by the auditor during your recent audit. A corrective action plan (CAP) for each finding must be sent to the auditor for approval. Once approved, the CAP will be uploaded by the audit company for Costco's review."]
[]
["Section #","Question Text","Answer","Notes:","Corrective Action Plan\n(Include Date To Be Completed)","Rood Cause Analysis & Preventative Action","Responsible Person\n(Name & Title)","Auditor Approval","Auditor Approval Date"]
["Section #","Question Text","Answer","Notes:","Corrective Action Plan\n(Include Date To Be Completed)","Rood Cause Analysis & Preventative Action","Responsible Person\n(Name & Title)","Auditor Approval","Auditor Approval Date"]
[{"$f":"Questions!B4","v":"3.1.1"},{"$f":"Questions!C4","v":"\nOperations must have a Supplier Approval Program in place to monitor and evaluate all raw material (including primary packaging) suppliers. \n\nThe Supplier Approval Program shall at a minimum include:\n\n- A requirement for suppliers to be audited by a third party to a standard that verifies implementation of GMP/GDP/GAP, HACCP/Preventive Controls/HARA, a traceability system, and a recall management plan. The requirements shall have pass/fail criteria defined for the supplier’s audits to maintain approved status.\n\n- Annual verification of the supplier’s audit e.g. confirming the supplier passed their annual audit. \n\n- Where there are label claims such as “organic”, “Gluten Free”, “non-GMO”, ”no antibiotics”, “raised without antibiotics”, ”no hormones added”, or ”no hormones administered” the operation must validate these through any combination of testing, certifications, or audits.\n"},{"$f":"IFERROR((Questions!E4 &\"\"),\"\")","v":""},{"$f":"IFERROR((Questions!F4 &\"\"),\"\")","v":""}]
[{"$f":"Questions!B5","v":"3.1.2"},{"$f":"Questions!C5","v":"\nOperations must have a comprehensive foreign material control plan in place for known and reasonably foreseeable physical hazards. In addition to GFSI requirements the foreign material control plan at a minimum must include:\n\n- A policy that restricts the use of materials in product zones and areas that are not easily cleanable or prone to creating foreign material contamination. These materials include - but\nare not limited to - foam rubber, any type of carpet, wood, non-food grade plastic, cardboard, tape, etc. Clothes, towels, and other cleaning materials that pose a risk of contamination or adulteration shall not be used to remove dirt and debris from products.\nWorkers must not handle products in a manner that results in contamination or adulteration.\n\n- A mechanism for employees to report concerns that includes specific language for foreign material contamination.\n\n- Annual training on foreign material hazards for all employees at the facility, including instruction on the mechanism employees can use to report concerns\n"},{"$f":"IFERROR((Questions!E5 &\"\"),\"\")","v":""},{"$f":"IFERROR((Questions!F5 &\"\"),\"\")","v":""}]
[{"$f":"Questions!B6","v":"3.1.3"},{"$f":"Questions!C6","v":"\nAll manufacturing operations must have a foreign material detection system (metal detection, x-ray, sieves, optical sorter etc.) installed, selecting the most effective solutions available for their products and processes. Suppliers must justify their choice with documented scientific and technical evidence that proves the system’s effectiveness in reducing contamination, citing sources like expert recommendations, scientific literature, regulatory guidance, and validation studies:\n\n- Shell Eggs, whole raw agricultural commodities, whole roasted coffee beans, whole muscle meats, whole or portioned in shell crab; whole lobster tails, Whole, eviscerated fish, hand portioned fish fillets and peeled/de-headed shrimp, and packaging products will be exempt from the foreign material device requirement. The operation will need to maintain current good manufacturing practices and prerequisite programs to mitigate foreign material contamination.\n\n- Operations that utilize a physical barrier (e.g. screen, filter, sieve) that's appropriately sized and placed just prior to packaging will be exempt from the foreign material device requirement. The operation will need to conduct integrity checks at a defined frequency, and maintain current good manufacturing practices and prerequisite programs to mitigate foreign material contamination.\n"},{"$f":"IFERROR((Questions!E6 &\"\"),\"\")","v":""},{"$f":"IFERROR((Questions!F6 &\"\"),\"\")","v":"Please describe the FM system(s) in use and justification for effectiveness."}]
[{"$f":"Questions!B7","v":"3.1.4"},{"$f":"Questions!C7","v":"\nAll foreign material devices must have a proper rejection mechanism to segregate rejected products. Rejected products must be physically segregated and have access restricted until evaluation by designated personnel can be completed. \n\nOperations must perform documented foreign material detection challenges at a defined frequency, but at a minimum: \n\n- At the start and finish of daily production/shift.\n- At ≤ 2 (two) hour intervals during the production run.\n- When changes in production batches occur.\n- When changes in machine settings occur.\n- After downtime for repairs.\n"},{"$f":"IFERROR((Questions!E7 &\"\"),\"\")","v":""},{"$f":"IFERROR((Questions!F7 &\"\"),\"\")","v":""}]
[{"$f":"Questions!B8","v":"3.1.5"},{"$f":"Questions!C8","v":"\nCostco requires that suppliers show that traceability exercises were conducted independently at least twice during the year. The system must be able to account for 100% of the product in a 2-hour timeframe. Site must show that they have conducted separate trace exercises for two of the three areas defined in the Costco requirements:\n- Finished goods\n- Raw material/ingredients\n- Primary packaging\n\nThe third area should be the subject of the onsite auditor-initiated trace exercise. Each exercise must be completed within a 2-hour limit and account for 100% of the selected sample. \n"},{"$f":"IFERROR((Questions!E8 &\"\"),\"\")","v":""},{"$f":"IFERROR((Questions!F8 &\"\"),\"\")","v":"Please describe the auditor-initiated trace exercise and summarize the results."}]
[{"$f":"Questions!B9","v":"3.1.6"},{"$f":"Questions!C9","v":"\nFor finished food products that are shipped to an intermediary facility prior to delivery to a Costco depot or warehouse, the following mock recall requirements apply:\n\n• Annual Mock Recall:\n- Suppliers must conduct an annual mock recall exercise.\n- This exercise must verify the accuracy of current contact information for the intermediary facility and confirm that the quantities of product received and distributed by the intermediary facility match the supplier's production and distribution records of a selected lot code.\n- Evidence of communication with the intermediary facility, including verification of contact information and quantity reconciliation to the specific lot code, must be documented.\n\n• Direct Shipment Exclusion:\n- Suppliers shipping finished food products directly to a Costco depot or warehouse are exempt from these intermediary facility-specific mock recall requirements.\n"},{"$f":"IFERROR((Questions!E9 &\"\"),\"\")","v":""},{"$f":"IFERROR((Questions!F9 &\"\"),\"\")","v":""}]
{"$rows_left_out":8}
{"sheet":"Guidance","index":3,"n_rows":32,"n_cols":15,"rows_kept":32,"cut":false,"hidden":false,"merged":[[14,6,17,6],[0,0,0,1],[0,2,0,6],[28,0,28,6],[29,0,30,6]]}
[null,null,"Assessment Rating System"]
[]
[null,null,null,null,null,null,null,null,null,null,"Yes","PASS",5,null,"Approved"]
["This rating system describes a food plant's level of compliance with recognized food safety and Good Manufacturing Practices.  ",null,null,null,null,null,null,null,null,null,"No","FAIL",4,null,"In Process"]
["The point system and definitions are objective guidelines for evaluating the plant's compliance with the assessed standards",null,null,null,null,null,null,null,null,null,"N/A",null,3,null,"Rejected"]
[" and are intended to assure consistency in rating. ",null,null,null,null,null,null,null,null,null,null,null,2]
[null,null,null,null,null,null,null,null,null,null,null,null,1]
["Comments must be provided for any standard rated lower than 5.",null,null,null,null,null,null,null,null,null,null,null,0]
[" ",null,null,null,null,null,null,null,null,null,null,null,"N/A"]
["Questions are scored per the matrix, with 5 being the highest rating possible and 0 being the lowest. If isolated issues"]
["for any element are found, an additional one point deduction will be applied to the question's rating OR "]
["if numerous issues for any element are found, an additional two point deduction will be applied to the question's rating."]
[]
["Number of elements in question",">3 elements missed","3 elements missed","2 elements missed","1 element missed","All elements fulfilled"]
[">3",0,2,3,4,5,"Rating given to question"]
[3,"N/A",0,2,4,5]
[2,"N/A","N/A",0,3,5]
[1,"N/A","N/A","N/A",0,5]
[]
["Definitions:"]
{"$rows_left_out":12}