{"text_format":"1","workbook":"xlsx","n_sheets":7,"sheets":["General Information","Questions","Employee Interviews","Non Conformances","NA Critical Questions","Guidance","Change Tracker"],"not_rendered":{"charts":0,"images":3,"macros":1,"external_links":0,"defined_names":7,"comments":0,"pivot_tables":0},"unopened":[],"bounds":{"document_bytes":16777216,"sheet_cells":100000,"rows_first":2000,"rows_last":500,"rows_between":2000,"halvings":0,"cell_chars":16384,"cell_head_chars":4096},"cells_cut":0,"cells_raw":0,"read":"whole","date_system":"1900"}

{"sheet":"General Information","index":0,"n_rows":49,"n_cols":26,"rows_kept":49,"cut":false,"hidden":false,"merged":[[0,2,0,4],[1,1,1,4],[2,2,2,4],[3,2,3,4],[4,2,4,4],[5,2,5,4],[6,2,6,4],[7,2,7,4],[8,2,8,4],[9,2,9,4],[10,2,10,4],[11,2,11,4],[12,2,12,4],[13,2,13,4],[14,2,14,4],[15,2,15,4],[16,2,16,4],[17,2,17,4],[18,2,18,4],[19,2,19,4],[20,2,20,4],[28,2,28,4],[29,2,29,4],[30,1,30,4],[43,2,43,4],[44,2,44,4],[45,2,45,4],[46,2,46,4],[47,1,47,4],[21,2,21,4],[22,1,22,4],[23,2,23,4],[24,2,24,4],[25,2,25,4],[26,2,26,4],[27,2,27,4]]}
[null,null,"Costco Food Safety GMP Audit V3.0"]
[null,"General Information"]
[null,"Supplier Name:"]
[null,"Facility Name:"]
[null,"Street Address:"]
[null,"City:"]
[null,"State/Province:"]
[null,"Country:"]
[null,"Postal Code:"]
[null,"Facility Contact Name:"]
[null,"Title:"]
[null,"Email:"]
[null,"Phone:"]
[null,"EFA Request Number:"]
[null,"Audit Type:",{"$f":"C1","v":"Costco Food Safety GMP Audit V3.0"}]
[null,"Auditor Name:"]
[null,"Audit Company:"]
[null,"Audit Dates:"]
[null,"Announced/Unannounced:"]
[null,"Total Number of Hours On Site:"]
{"$rows_left_out":30}
{"sheet":"Questions","index":1,"n_rows":223,"n_cols":10,"rows_kept":223,"cut":false,"hidden":false,"merged":[[0,2,0,4]]}
[null,null,{"$f":"'General Information'!C15:E15 & \" - Questions\"","v":"Costco Food Safety GMP Audit V3.0 - Questions"},null,null,null,null,"Awarded","Possible"]
["Section Name ","Section #","Question Text","Allowable Answers","Answer","Notes\n(required for a score of 4, 3, 2, 1, 0, N/A - or where otherwise noted )",null,"Awarded","Possible","Critical Flag"]
["Costco Product",null,null,null,null,null,null,null,null,0]
["Costco Product","1.1.1","\nPlease list the product(s) currently supplied to Costco (Costco item number and product description).\n","NARRATIVE","USE NOTES",null,null,null,null,0]
["Facility Information",null,null,null,null,null,null,null,null,0]
["Facility Details","2.1.1","\nUSDA Facility Number (If applicable):\n","NARRATIVE","USE NOTES",null,null,null,null,0]
["Facility Details","2.1.2","\nLaboratory Facility Capabilities (Physical, Analytical/Microbiological):\n","NARRATIVE","USE NOTES",null,null,null,null,0]
["Facility Details","2.1.3","\nHACCP or PCQI Certified? List name and position\n","Yes, No",null,null,null,null,null,0]
["Facility Details","2.1.4","\n~If Yes where was the class taken?\n","Classroom, Internet",null,null,null,null,null,0]
["Facility Details","2.1.5","\n~Certificate Expiration Date(s):\n","NARRATIVE","USE NOTES",null,null,null,null,0]
["Facility Details","2.1.6","\nFacility authorizes the certification body to release and upload the full audit report(s) into Costco's database of choice.\n","Yes, No",null,null,null,null,null,0]
["Facility Allergens Information","2.2.1","\nPlease list the current allergen(s) utilized in the operation.\n","NARRATIVE","USE NOTES",null,null,null,null,0]
["Management Systems",null,null,null,null,null,null,null,null,0]
["Management Policies","3.1.1","\n •  Executive Management (Owner) has a written policy statement that outlines the organization's commitment to produce safe products while meeting all legal and regulatory requirements.\n •  The policy is signed by senior management and is regularly communicated to all employees.\n •  Supervisory staff is trained to understand and implement policy.\n","5, 4, 3, 2, 1, 0, N/A",null,null,null,{"$f":"E14","v":0},{"$f":"IF(E14=\"N/A\",0,5)","v":5},0]
["Management Policies","3.1.2","\nExecutive Management (Owner) demonstrates commitment to make resources available to implement and maintain prerequisite and food safety programs. \n","5, 4, 3, 2, 1, 0, N/A",null,null,null,{"$f":"E15","v":0},{"$f":"IF(E15=\"N/A\",0,5)","v":5},0]
["Management Policies","3.1.3","\nManagement actively maintains the facility, and prioritizes repairs to the facility and equipment based on food safety risk to the product or process.\n","5, 4, 3, 2, 1, 0, N/A",null,null,null,0,5,0]
["Organization","3.2.1","\n •  There is a written organization chart showing the management structure of the company. \n •  The chart indicates/links the reporting structure of all individuals responsible for food safety and quality to upper management.\n","5, 4, 3, 2, 1, 0, N/A",null,null,null,0,5,0]
["Organization","3.2.2","\nDoes the facility have a designated Food Safety/Quality Manager that reports outside of the production hierarchy?\n","5, 4, 3, 2, 1, 0, N/A",null,null,null,0,5,0]
["Organization","3.2.3","\n •  There are written job descriptions for all key food safety personnel defining responsibilities. \n •  There are provisions made to cover for the absence of key food safety staff.\n","5, 4, 3, 2, 1, 0, N/A",null,null,null,0,5,0]
["Written Procedures","3.3.1","\nTHE FACILITY HAS A WRITTEN FOOD SAFETY PLAN THAT COMPLIES WITH ALL APPLICABLE \nREGULATIONS AND OUTLINES PROCEDURES, METHODS, AND PRACTICES NECESSARY TO \nACHIEVE SET RECOGNIZED STANDARDS. THE FOOD SAFETY PLAN INCLUDES:\n     •  A HAZARD ANALYSIS.\n     •  PREVENTATIVE CONTROLS.\n     •  SUPPLY CHAIN PROGRAMS.\n     •  RECALL PLANS.\n     •  CORRECTIVE ACTION PROCEDURES.\n     •  VERIFICATION PROCEDURES.\n","5, 4, 3, 2, 1, 0, N/A",null,null,{"$f":"IF(E20=0,\"AUTOMATIC FAILURE\",\"\")","v":"AUTOMATIC FAILURE"},{"$f":"E20","v":0},{"$f":"IF(E20=\"N/A\",0,5)","v":5},1]
{"$rows_left_out":204}
{"sheet":"Employee Interviews","index":2,"n_rows":3,"n_cols":5,"rows_kept":3,"cut":false,"hidden":false,"merged":[[0,1,0,4],[1,0,1,4]]}
[null,{"$f":"'General Information'!C15 & \" - Employee Interviews\"","v":"Costco Food Safety GMP Audit V3.0 - Employee Interviews"}]
["Employee Interviews: List those interviewed"]
["First Name","Position","Department","Shift","Employee demonstrates knowledge and can/is applying the training received (Yes/No)"]

{"sheet":"Non Conformances","index":3,"n_rows":232,"n_cols":9,"rows_kept":232,"cut":false,"hidden":false,"merged":[[5,4,8,4],[5,5,8,5],[0,0,0,4],[1,0,1,1],[1,2,1,3],[1,4,1,5],[2,4,4,4],[2,5,4,5]]}
["Corrective Action Plan"]
["Facility Information",null,"Audit Information",null,"CAP Information"]
["Supplier",{"$f":"IFERROR(('General Information'!C3 &\"\"),\"\")","v":""},"EFA Request #",{"$f":"IFERROR(('General Information'!C14 &\"\"),\"\")","v":""},"Total Findings",{"$f":"SUM(COUNTIFS(Questions!E14:E223,{\"<5\",\"=No\"}))","v":0},null,"Approved"]
["Facility",{"$f":"IFERROR(('General Information'!C4 &\"\"),\"\")","v":""},"Audit Type",{"$f":"IFERROR(('General Information'!C15 &\"\"),\"\")","v":"Costco Food Safety GMP Audit V3.0"},null,null,null,"In Process"]
["Address",{"$f":"IFERROR(('General Information'!C5 &\"\"),\"\")","v":""},"Auditor",{"$f":"IFERROR(('General Information'!C16 &\"\"),\"\")","v":""},null,null,null,"Rejected"]
["Contact",{"$f":"IFERROR(('General Information'!C10 &\"\"),\"\")","v":""},null,null,"Status"]
["Title",{"$f":"IFERROR(('General Information'!C11 &\"\"),\"\")","v":""},"Audit Company",{"$f":"IFERROR(('General Information'!C17 &\"\"),\"\")","v":""}]
["Email",{"$f":"IFERROR(('General Information'!C12 &\"\"),\"\")","v":""},"Audit Date(s)",{"$f":"IFERROR(('General Information'!C18 &\"\"),\"\")","v":""}]
["Phone",{"$f":"IFERROR(('General Information'!C13 &\"\"),\"\")","v":""}]
[]
["Below are the non-conformances that have been identified by the auditor during your recent audit. A corrective action plan (CAP) for each finding must be sent to the auditor for approval. Once approved, the CAP will be uploaded by the audit company for Costco's review."]
[]
["Section #","Question Text","Answer","Notes","Corrective Action Plan \n(Include Date To Be Completed)","Root Cause Analysis & Preventative Action","Responsible Person\n(Name & Title)","Auditor Approval","Auditor Approval Date"]
["Section #","Question Text","Answer","Notes:","Corrective Action Plan \n(Include Completion Date)","Root Cause Analysis & Preventative Action","Responsible Person\n(Name & Title)","Auditor Approval","Auditor Approval Date"]
[{"$f":"Questions!B14","v":"3.1.1"},{"$f":"Questions!C14","v":"\n •  Executive Management (Owner) has a written policy statement that outlines the organization's commitment to produce safe products while meeting all legal and regulatory requirements.\n •  The policy is signed by senior management and is regularly communicated to all employees.\n •  Supervisory staff is trained to understand and implement policy.\n"},{"$f":"IFERROR((Questions!E14 &\"\"),\"\")","v":""},{"$f":"IFERROR((Questions!F14 &\"\"),\"\")","v":""}]
[{"$f":"Questions!B15","v":"3.1.2"},{"$f":"Questions!C15","v":"\nExecutive Management (Owner) demonstrates commitment to make resources available to implement and maintain prerequisite and food safety programs. \n"},{"$f":"IFERROR((Questions!E15 &\"\"),\"\")","v":""},{"$f":"IFERROR((Questions!F15 &\"\"),\"\")","v":""}]
[{"$f":"Questions!B16","v":"3.1.3"},{"$f":"Questions!C16","v":"\nManagement actively maintains the facility, and prioritizes repairs to the facility and equipment based on food safety risk to the product or process.\n"},{"$f":"IFERROR((Questions!E16 &\"\"),\"\")","v":""},{"$f":"IFERROR((Questions!F16 &\"\"),\"\")","v":""}]
[{"$f":"Questions!B17","v":"3.2.1"},{"$f":"Questions!C17","v":"\n •  There is a written organization chart showing the management structure of the company. \n •  The chart indicates/links the reporting structure of all individuals responsible for food safety and quality to upper management.\n"},{"$f":"IFERROR((Questions!E17 &\"\"),\"\")","v":""},{"$f":"IFERROR((Questions!F17 &\"\"),\"\")","v":""}]
[{"$f":"Questions!B18","v":"3.2.2"},{"$f":"Questions!C18","v":"\nDoes the facility have a designated Food Safety/Quality Manager that reports outside of the production hierarchy?\n"},{"$f":"IFERROR((Questions!E18 &\"\"),\"\")","v":""},{"$f":"IFERROR((Questions!F18 &\"\"),\"\")","v":""}]
[{"$f":"Questions!B19","v":"3.2.3"},{"$f":"Questions!C19","v":"\n •  There are written job descriptions for all key food safety personnel defining responsibilities. \n •  There are provisions made to cover for the absence of key food safety staff.\n"},{"$f":"IFERROR((Questions!E19 &\"\"),\"\")","v":""},{"$f":"IFERROR((Questions!F19 &\"\"),\"\")","v":""}]
{"$rows_left_out":213}
{"sheet":"NA Critical Questions","index":4,"n_rows":222,"n_cols":5,"rows_kept":222,"cut":false,"hidden":true,"merged":[[0,0,0,4]]}
["N/A Critical Questions"]
[]
["Below is a summary of non applicable critical questions. "]
[]
["Section #","Question Text","Answer","Notes","Critical Question"]
["Section #","Question Text","Rating","Notes:","Critical Question"]
[{"$f":"Questions!B14","v":"3.1.1"},{"$f":"Questions!C14","v":"\n •  Executive Management (Owner) has a written policy statement that outlines the organization's commitment to produce safe products while meeting all legal and regulatory requirements.\n •  The policy is signed by senior management and is regularly communicated to all employees.\n •  Supervisory staff is trained to understand and implement policy.\n"},{"$f":"IFERROR((Questions!E14 &\"\"),\"\")","v":""},{"$f":"IFERROR((Questions!F14 &\"\"),\"\")","v":""},{"$f":"IF(Questions!J14=1,\"Critical\",\" \")","v":" "}]
[{"$f":"Questions!B15","v":"3.1.2"},{"$f":"Questions!C15","v":"\nExecutive Management (Owner) demonstrates commitment to make resources available to implement and maintain prerequisite and food safety programs. \n"},{"$f":"IFERROR((Questions!E15 &\"\"),\"\")","v":""},{"$f":"IFERROR((Questions!F15 &\"\"),\"\")","v":""},{"$f":"IF(Questions!J15=1,\"Critical\",\" \")","v":" "}]
[{"$f":"Questions!B16","v":"3.1.3"},{"$f":"Questions!C16","v":"\nManagement actively maintains the facility, and prioritizes repairs to the facility and equipment based on food safety risk to the product or process.\n"},{"$f":"IFERROR((Questions!E16 &\"\"),\"\")","v":""},{"$f":"IFERROR((Questions!F16 &\"\"),\"\")","v":""},{"$f":"IF(Questions!J16=1,\"Critical\",\" \")","v":" "}]
[{"$f":"Questions!B17","v":"3.2.1"},{"$f":"Questions!C17","v":"\n •  There is a written organization chart showing the management structure of the company. \n •  The chart indicates/links the reporting structure of all individuals responsible for food safety and quality to upper management.\n"},{"$f":"IFERROR((Questions!E17 &\"\"),\"\")","v":""},{"$f":"IFERROR((Questions!F17 &\"\"),\"\")","v":""},{"$f":"IF(Questions!J17=1,\"Critical\",\" \")","v":" "}]
[{"$f":"Questions!B18","v":"3.2.2"},{"$f":"Questions!C18","v":"\nDoes the facility have a designated Food Safety/Quality Manager that reports outside of the production hierarchy?\n"},{"$f":"IFERROR((Questions!E18 &\"\"),\"\")","v":""},{"$f":"IFERROR((Questions!F18 &\"\"),\"\")","v":""},{"$f":"IF(Questions!J18=1,\"Critical\",\" \")","v":" "}]
[{"$f":"Questions!B19","v":"3.2.3"},{"$f":"Questions!C19","v":"\n •  There are written job descriptions for all key food safety personnel defining responsibilities. \n •  There are provisions made to cover for the absence of key food safety staff.\n"},{"$f":"IFERROR((Questions!E19 &\"\"),\"\")","v":""},{"$f":"IFERROR((Questions!F19 &\"\"),\"\")","v":""},{"$f":"IF(Questions!J19=1,\"Critical\",\" \")","v":" "}]
[{"$f":"Questions!B20","v":"3.3.1"},{"$f":"Questions!C20","v":"\nTHE FACILITY HAS A WRITTEN FOOD SAFETY PLAN THAT COMPLIES WITH ALL APPLICABLE \nREGULATIONS AND OUTLINES PROCEDURES, METHODS, AND PRACTICES NECESSARY TO \nACHIEVE SET RECOGNIZED STANDARDS. THE FOOD SAFETY PLAN INCLUDES:\n     •  A HAZARD ANALYSIS.\n     •  PREVENTATIVE CONTROLS.\n     •  SUPPLY CHAIN PROGRAMS.\n     •  RECALL PLANS.\n     •  CORRECTIVE ACTION PROCEDURES.\n     •  VERIFICATION PROCEDURES.\n"},{"$f":"IFERROR((Questions!E20 &\"\"),\"\")","v":""},{"$f":"IFERROR((Questions!F20 &\"\"),\"\")","v":""},{"$f":"IF(Questions!J20=1,\"Critical\",\" \")","v":"Critical"}]
[{"$f":"Questions!B21","v":"3.3.2"},{"$f":"Questions!C21","v":"\n •   The Food Safety Plan is readily available to facility personnel. \n •  Facility personnel are trained to understand and implement food safety procedures, methods, and practices. \n •  The Food Safety Plan is reviewed annually, or when changes occur to the process, to determine the effectiveness of the procedure methods and practices.\n"},{"$f":"IFERROR((Questions!E21 &\"\"),\"\")","v":""},{"$f":"IFERROR((Questions!F21 &\"\"),\"\")","v":""},{"$f":"IF(Questions!J21=1,\"Critical\",\" \")","v":" "}]
[{"$f":"Questions!B22","v":"3.3.3"},{"$f":"Questions!C22","v":"\nIf an outside agency was used to develop the Food Safety Plan, does management have a strategy for implementing and maintaining this plan?\n"},{"$f":"IFERROR((Questions!E22 &\"\"),\"\")","v":""},{"$f":"IFERROR((Questions!F22 &\"\"),\"\")","v":""},{"$f":"IF(Questions!J22=1,\"Critical\",\" \")","v":" "}]
[{"$f":"Questions!B23","v":"3.3.4"},{"$f":"Questions!C23","v":"\n~If the answer to the previous question is yes, who is responsible for overseeing the implementation of the externally developed Food Safety Plan?\n"},{"$f":"IFERROR((Questions!E23 &\"\"),\"\")","v":"USE NOTES"},{"$f":"IFERROR((Questions!F23 &\"\"),\"\")","v":""},{"$f":"IF(Questions!J23=1,\"Critical\",\" \")","v":" "}]
[{"$f":"Questions!B24","v":"3.3.5"},{"$f":"Questions!C24","v":"\nA WRITTEN GMP PROGRAM HAS BEEN ESTABLISHED THAT COMPLIES WITH ALL APPLICABLE REGULATIONS AND ADDRESSES: \n     •  EMPLOYEE HYGIENE. \n     •  PEST CONTROL. \n     •  SANITATION. \n     •  FACILITY MANAGEMENT.\n"},{"$f":"IFERROR((Questions!E24 &\"\"),\"\")","v":""},{"$f":"IFERROR((Questions!F24 &\"\"),\"\")","v":""},{"$f":"IF(Questions!J24=1,\"Critical\",\" \")","v":"Critical"}]
[{"$f":"Questions!B25","v":"3.4.1"},{"$f":"Questions!C25","v":"\nThe facility has a written Regulatory Affairs and Inspection program. The program identifies employees responsible to manage the regulatory process and the facility demonstrates compliance to applicable regulatory requirements.\n"},{"$f":"IFERROR((Questions!E25 &\"\"),\"\")","v":""},{"$f":"IFERROR((Questions!F25 &\"\"),\"\")","v":""},{"$f":"IF(Questions!J25=1,\"Critical\",\" \")","v":" "}]
[{"$f":"Questions!B26","v":"3.4.2"},{"$f":"Questions!C26","v":"\nThe Regulatory Affairs and Inspection program specifies that duplicate samples are to be taken when any regulatory samples of product are taken. Any products associated with the sampling are held pending regulatory results. The facility maintains records pertaining to any regulatory sampling.\n"},{"$f":"IFERROR((Questions!E26 &\"\"),\"\")","v":""},{"$f":"IFERROR((Questions!F26 &\"\"),\"\")","v":""},{"$f":"IF(Questions!J26=1,\"Critical\",\" \")","v":" "}]
[{"$f":"Questions!B27","v":"3.4.3"},{"$f":"Questions!C27","v":"\nProducts are reviewed for compliance to regulatory requirements for markets to which they are shipped. Records are maintained to support that regulatory reviews have been conducted.\n"},{"$f":"IFERROR((Questions!E27 &\"\"),\"\")","v":""},{"$f":"IFERROR((Questions!F27 &\"\"),\"\")","v":""},{"$f":"IF(Questions!J27=1,\"Critical\",\" \")","v":" "}]
{"$rows_left_out":203}
{"sheet":"Guidance","index":5,"n_rows":32,"n_cols":16,"rows_kept":32,"cut":false,"hidden":false,"merged":[[0,0,0,1],[0,2,0,6],[14,6,17,6],[28,0,28,6],[31,0,32,6],[29,0,30,6]]}
[null,null,"Assessment Rating System"]
[]
[null,null,null,null,null,null,null,null,null,null,"Yes","PASS",5,null,"Approved","Classroom"]
["This rating system describes a food facility's level of compliance with recognized food safety and Good Manufacturing Practices.  ",null,null,null,null,null,null,null,null,null,"No","FAIL",4,null,"In Process","Internet"]
["The point system and definitions are objective guidelines for evaluating the facility's compliance with the assessed standards",null,null,null,null,null,null,null,null,null,"N/A",null,3,null,"Rejected"]
["and are intended to assure consistency in rating. ",null,null,null,null,null,null,null,null,null,null,null,2]
[null,null,null,null,null,null,null,null,null,null,null,null,1]
["Comments must be provided for any standard rated lower than 5.",null,null,null,null,null,null,null,null,null,null,null,0]
[" ",null,null,null,null,null,null,null,null,null,null,null,"N/A"]
["Questions are scored per the matrix, with 5 being the highest rating possible and 0 being the lowest. If isolated issues"]
["for any element are found, an additional one point deduction will be applied to the question's rating OR "]
["if numerous issues for any element are found, an additional two point deduction will be applied to the question's rating."]
[]
["Number of elements in question",">3 elements missed","3 elements missed","2 elements missed","1 element missed","All elements fulfilled"]
[">3",0,2,3,4,5,"Rating given to question"]
[3,"N/A",0,2,4,5]
[2,"N/A","N/A",0,3,5]
[1,"N/A","N/A","N/A",0,5]
[]
["Definitions:"]
{"$rows_left_out":13}
{"sheet":"Change Tracker","index":6,"n_rows":0,"n_cols":0,"rows_kept":0,"cut":false,"hidden":true,"merged":[]}