{"text_format":"1","workbook":"xlsx","n_sheets":4,"sheets":["Datos","Presentación","Cronograma","Varios"],"not_rendered":{"charts":0,"images":3,"macros":1,"external_links":2,"defined_names":13,"comments":0,"pivot_tables":0},"unopened":[],"bounds":{"document_bytes":16777216,"sheet_cells":100000,"rows_first":2000,"rows_last":500,"rows_between":2000,"halvings":0,"cell_chars":16384,"cell_head_chars":4096},"cells_cut":0,"cells_raw":0,"read":"whole","date_system":"1900"}

{"sheet":"Datos","index":0,"n_rows":54,"n_cols":9,"rows_kept":54,"cut":false,"hidden":false,"merged":[[53,2,53,8],[52,2,52,3]]}
[]
[null,null,"Calculadora Crédito Efectivo / Consumo"]
[]
[]
[null,null,"Por favor ingresa los siguientes datos:"]
[]
[null,null,"Fecha de desembolso",null,null,null,null,"2024-07-22","(dd/mm/aaaa)"]
[null,null,"Día de Pago (1-31) ",null,null,null,null,{"$f":"+Varios!D71","v":30}]
[null,null,"Plazo (en Meses)",null,null,null,null,{"$f":"+Varios!G72","v":1}]
[null,null,null,null,null,null,null,0]
[null,null,"Moneda"]
[null,null,"Seguro de Protección Financiera"]
[null,null,"Envío de Estado de Cuenta"]
[null,null,"Tipo Cliente"]
[null,null,"Rango de Ingreso"]
[null,null,"Tasa de Interés Efectiva Anual (En base a 360 días)",null,null,null,null,{"$f":"+IF(Varios!$I$33=3,VLOOKUP(\"Otros\",Varios!$D$24:$G$60,3,FALSE),VLOOKUP(Varios!I33&Varios!O43,Varios!B24:G60,IF(Varios!C4=1,5,6),FALSE))","v":0.95899999999999996}]
[null,null,"Ingrese Tasa",null,null,null,null,0.95899999999999996]
[null,null,"Tasa de Interés Nominal Anual",null,null,null,null,{"$f":"+((1+H16)^(1/12)-1)*12","v":0.69163135750601157}]
[null,null,null,null,null,null,null,{"$f":"+(1+H18/12+H21)^12-1","v":0.98471438748092477}]
[null,null,"Tipo de Seguro de Desgravamen"]
[null,null,"Tasa mensual de Seguro de Desgravamen*",null,null,null,null,{"$f":"+IF(Varios!G5=1,Varios!H2,IF(Varios!G5=2,Varios!H3,Varios!H4))","v":1.15E-3}]
[null,null,"Evaluación de Póliza Endosada",null,null,null,null,{"$f":"+IF(Varios!G5=2,Varios!F4,0)","v":0}]
[null,null,"Envío Físico de Estado de Cuenta",null,null,null,{"$f":"+G44","v":"S/."},{"$f":"IF(Varios!$K$5=1,VLOOKUP(Varios!C4,Varios!B2:E3,4,FALSE),0)","v":0}]
[null,null,"Cuota Adicional en Julio",null,null,null,null,0]
[null,null,"Cuota Adicional en Diciembre ",null,null,null,null,0]
[null,null,"Modalidad de pago (Cuotas por Año)",null,null,null,null,{"$f":"12+H24+H25","v":12}]
[null,null,"Ingrese Monto a solicitar",null,null,null,{"$f":"+IF(Varios!C4=1,\"S/.\",\"US$\")","v":"S/."},500]
[null,null,"Intereses por Cambio de Fecha",null,null,null,{"$f":"+IF(Varios!C4=1,\"S/.\",\"US$\")","v":"S/."},{"$f":"IFERROR(+Cronograma!AB13,\"\")","v":0}]
[null,null,"Seguros por Cambio de Fecha",null,null,null,{"$f":"+IF(Varios!C4=1,\"S/.\",\"US$\")","v":"S/."},{"$f":"+IFERROR(Cronograma!AF13,\"\")","v":0}]
[]
{"$rows_left_out":25}
{"sheet":"Presentación","index":1,"n_rows":28,"n_cols":4,"rows_kept":28,"cut":false,"hidden":false,"merged":[[27,0,28,4]]}
[]
[]
["Simulación de Crédito Efectivo / Consumo"]
[]
[]
[]
["Datos del Crédito"]
["Monto del Préstamo",null,{"$f":"+IF(Varios!$C$4=1,\"S/.\",\"US$\")","v":"S/."},{"$f":"Cronograma!M12","v":500}]
["Plazo de Financiamiento (meses)",null,null,{"$f":"+Datos!H9","v":1}]
["Número de Cuotas Fijas Anuales",null,null,{"$f":"+Datos!H26","v":12}]
["Tasa de Interés Efectiva Anual (en base a 360 días)",null,null,{"$f":"+Datos!H16","v":0.95899999999999996}]
["Fecha de Desembolso",null,null,{"$f":"+Datos!H7","v":"2024-07-22"}]
["Fecha de Pago",null,null,{"$f":"+CONCATENATE(DAY(Datos!H8),\" \",\"de cada mes\")","v":"30 de cada mes"}]
["Portes Mensuales",null,{"$f":"+IF(Varios!$C$4=1,\"S/.\",\"US$\")","v":"S/."},{"$f":"+Datos!H23","v":0}]
["Tasa de Seguro de Desgravamen",null,null,{"$f":"+Datos!H21","v":1.15E-3}]
["Seguro de Protección Financiera (SPF) 0.192%",null,null,{"$f":"+IF(Varios!$K$15=1,Varios!$K$12,Varios!$K$13)","v":0}]
[]
["Cuota Mensual",null,{"$f":"+IF(Varios!$C$4=1,\"S/.\",\"US$\")","v":"S/."},{"$f":"+Datos!H46","v":530.35357233706441}]
["Tasa de Costo Efectivo Anual (base 360 días)",null,null,{"$f":"+Datos!H47","v":0.98261647943889896}]
[]
["Total de Intereses a Pagar",null,{"$f":"+IF(Varios!$C$4=1,\"S/.\",\"US$\")","v":"S/."},{"$f":"+Cronograma!P9","v":29.778572337064386}]
["Total Seguro de Desgravamen",null,{"$f":"+IF(Varios!$C$4=1,\"S/.\",\"US$\")","v":"S/."},{"$f":"+Cronograma!Q9","v":0.57499999999999996}]
["Total Envío de información periódica",null,{"$f":"+IF(Varios!$C$4=1,\"S/.\",\"US$\")","v":"S/."},{"$f":"+Cronograma!T9","v":0}]
["Total Amortización",null,{"$f":"+IF(Varios!$C$4=1,\"S/.\",\"US$\")","v":"S/."},{"$f":"+Cronograma!R9","v":500}]
["Total Seguro de Protección Financiera",null,{"$f":"+IF(Varios!$C$4=1,\"S/.\",\"US$\")","v":"S/."},{"$f":"+Cronograma!V9","v":0}]
["Cantidad Total a Pagar",null,{"$f":"+IF(Varios!$C$4=1,\"S/.\",\"US$\")","v":"S/."},{"$f":"+Cronograma!Q6","v":530.35357233706441}]
[]
["NOTA: Las cuotas son referenciales, sujetas a calificación y a la fecha de desembolso del crédito. No incluyen ITF."]

{"sheet":"Cronograma","index":2,"n_rows":73,"n_cols":35,"rows_kept":73,"cut":false,"hidden":false,"merged":[[2,10,2,23],[9,6,10,6],[9,25,9,27],[9,29,9,31],[8,10,8,12],[0,10,0,23]]}
[{"$f":"+Datos!H10","v":0},{"$f":"+Datos!H9+1+A1","v":2},{"$f":"+((1+Datos!H19)^(0.0833333333333333)-1)*12/365","v":1.9326886507014011E-3},{"$f":"+Datos!H8","v":30},{"$f":"SUM(R14:R73)","v":500},{"$f":"+E1-M12","v":0},530.35357233706441,null,null,null,null,null,null,null,null,null,null,null,null,null,null,null,null,null,null,null,null,null,null,null,null,null,null,{"$f":"+AH2-AH10","v":7.0876343102099781E-5}]
[null,null,null,null,null,null,null,null,null,null,"Cronograma",null,null,null,null,null,null,null,null,null,null,null,null,null,null,null,null,null,null,null,null,null,null,{"$f":"+M12","v":500}]
[null,null,null,null,null,null,null,null,null,null,"NOTA: Todo crédito se encuentra sujeto a la evaluación crediticia del Banco, quien determina el monto y plazo a otorgar. \n            Este documento ha sido emitido en base a la información proporcionada por el cliente y tiene caracter referencial. "]
[null,null,null,null,null,null,null,null,null,null,"Tasa de Interés Efectiva Anual (en base a 360 días):",null,null,null,null,null,{"$f":"+Datos!H16","v":0.95899999999999996}]
[null,null,null,null,null,null,null,null,null,null,"Tasa de Costo Efectivo Anual (en base a 360 días):",null,null,null,null,null,{"$f":"+AI11","v":0.98261647943889896}]
[null,null,null,null,null,null,null,null,null,null,"Cantidad Total a Pagar:",null,null,null,null,{"$f":"+IF(Varios!C4=1,\"S/.\",\"US$\")","v":"S/."},{"$f":"+SUM(X12:X73)","v":530.35357233706441}]
[]
[null,null,null,null,null,null,null,null,null,null,null,null,null,"Int + Seg","Int + Seg","Interés","Seguro Desg","Amortización","Cuota","Envío Físico de Estado de Cuenta","Evaluación de Póliza Endosada","Seguro de Protección Financiera","Cuota","Cuota"]
[null,null,null,null,null,null,null,null,null,null,"    Totales a pagar",null,null,null,null,{"$f":"+SUM(P12:P73)","v":29.778572337064386},{"$f":"+SUM(Q12:Q73)","v":0.57499999999999996},500,530.35357233706441,0,0,0,530.35357233706441,530.35357233706441]
[null,null,null,null,"Fecha",null,"Int. Acum.","Seg. "," ",null,null,null,null,null,null,null,null,null,null,null,null,null,null,null,null,"Interes x Pagar",null,null,null," Seguros x Pagar",null,null,null,{"$f":"+SUM(AH13:AH73)","v":499.9999291236569}]
[null,null,null,"Dia","Mes","Año",null,"Acum",null,null,"#","Fecha","Saldo","Int + Seg","Int + Seg","Interés","Seguro Desg","Amortización","Cuota","Envío Físico de Estado de Cuenta","Evaluación de Póliza Endosada","Seguro de Protección Financiera","Cuota","Cuota",null,"Calculado","Pdte","Total a Pagar",null,"Calculado","Pdte","Total a Pagar",null,1.0015526896959812,{"$f":"+(1+AH11)^(360/365)-1","v":0.98261647943889896}]
[0,{"$f":"IF(+MONTH(Datos!H7)=12,0,MONTH(Datos!H7))","v":7},null,{"$f":"DAY(Datos!H7)","v":22},{"$f":"+MONTH(Datos!H7)","v":7},{"$f":"YEAR(Datos!H7)","v":2024},null,null,null,null,null,{"$f":"IF(AND(D12<10,E12<10),CONCATENATE(\"0\",D12,\"/\",\"0\",E12,\"/\",F12),IF(AND(D12>9,E12<10),CONCATENATE(D12,\"/\",\"0\",E12,\"/\",F12),IF(AND(D12<10,E12>9),CONCATENATE(\"0\",D12,\"/\",E12,\"/\",F12),IF(AND(D12>9,E12>9),CONCATENATE(D12,\"/\",E12,\"/\",F12)))))","v":"22/07/2024"},{"$f":"Datos!H27","v":500}]
[{"$f":"+IF(B1>0,A12+1,0)","v":1},{"$f":"+IF(A13=0,0,IF(B12=12,1,B12+1))","v":8},null,{"$f":"D12","v":22},{"$f":"E12","v":7},{"$f":"F12","v":2024},{"$f":"+P13","v":0},{"$f":"+Q13","v":0},null,{"$f":"+IF(A13=0,\"\",A13)","v":1},null,{"$f":"IF(J13=\"\",\"\",IF(AND(D13<10,E13<10),CONCATENATE(\"0\",D13,\"/\",\"0\",E13,\"/\",F13),IF(AND(D13>9,E13<10),CONCATENATE(D13,\"/\",\"0\",E13,\"/\",F13),IF(AND(D13<10,E13>9),CONCATENATE(\"0\",D13,\"/\",E13,\"/\",F13),IF(AND(D13>9,E13>9),CONCATENATE(D13,\"/\",E13,\"/\",F13))))))","v":"22/07/2024"},{"$f":"IF(B13=0,\"\",M12)","v":500},{"$f":"IF(A13=0,\"\",IF(AND(Datos!$H$24>0,E13=7),IF(O13<$G$1*Datos!$H$24,O13,$G$1*Datos!$H$24),IF(AND(Datos!$H$25>0,E13=12),IF(O13<$G$1*Datos!$H$25,O13,$G$1*Datos!$H$25),IF((AB13+AF13)<S13,(AB13+AF13),S13))))","v":0},{"$f":"IF(A13=0,\"\",IF(S13=0,0,AB13+AF13))","v":0},{"$f":"IF($A13=0,\"\",IF(S13=0,0,IF(AB13<=(N13-Q13),AB13,N13-Q13)))","v":0},{"$f":"IF($A13=0,\"\",IF(S13=0,0,IF(AF13<=N13,AF13,N13)))","v":0},{"$f":"IF(B13=0,\"\",IF(X13=0,0,S13-N13))","v":0},0,{"$f":"+IF(S13=\"\",\"\",IF(Varios!$K$5=1,IF(S13=0,0,IF(Varios!$D$4=1,Varios!$D$2,Varios!$D$3)),0))","v":0},{"$f":"+IF(S13=\"\",\"\",IF(S13=0,0,Varios!$F$4))","v":0},{"$f":"IF(S13=\"\",\"\",IF(Varios!$K$15=1,IF(S13=0,0,Datos!$H$27*Varios!$K$12),0))","v":0},{"$f":"+IF(T13=\"\",\"\",S13+T13+U13+V13)","v":0},{"$f":"+IF(W13=\"\",\"\",W13)","v":0},null,null,null,null,null,null,null,null,{"$f":"IF(L13=\"\",\"\",L13-L$12)","v":0},{"$f":"+W13/((1+$AH$11)^(AG13/365))","v":0}]
[{"$f":"+IF(OR(A13=$B$1,A13=0),0,A13+1)","v":2},9,null,{"$f":"+IF($D$1=31,IF(F14/4=TRUNC(F14/4),VLOOKUP(E14,Varios!$C$10:$G$21,3,FALSE),VLOOKUP(E14,Varios!$C$10:$G$21,2,FALSE)),IF($D$1>28,IF(F14/4=TRUNC(F14/4),VLOOKUP(E14,Varios!$C$10:$G$21,5,FALSE),VLOOKUP(E14,Varios!$C$10:$G$21,4,FALSE)),$D$1))","v":22},{"$f":"IF(E13=12,1,E13+1)","v":8},{"$f":"+IF(E13=E14,F13,IF(E13+1>12,F13+1,F13))","v":2024},{"$f":"+IF(P14=\"\",\"\",G13+P14)","v":29.778572337064386},{"$f":"+IF(Q14=\"\",\"\",H13+Q14)","v":0.57499999999999996},null,{"$f":"+IF(A14=0,\"\",A14)","v":2},{"$f":"+IF(J14=\"\",\"\",J14-1)","v":1},{"$f":"L13+_xlfn.NUMBERVALUE(Datos!$H$8)","v":"2024-08-21"},{"$f":"IF(B14=0,\"\",IF($A$1+1=J14,M13+G14+H14,IF($A$1+1<J14,M13-R14,M13)))","v":0},{"$f":"IF(A14=0,\"\",IF(AND(Datos!$H$24>0,E14=7),IF(O14<$G$1*Datos!$H$24,O14,$G$1*Datos!$H$24),IF(AND(Datos!$H$25>0,E14=12),IF(O14<$G$1*Datos!$H$25,O14,$G$1*Datos!$H$25),IF((AB14+AF14)<S14,(AB14+AF14),S14))))","v":30.353572337064385},{"$f":"IF(A14=0,\"\",IF(S14=0,0,AB14+AF14))","v":30.353572337064385},{"$f":"IF($A14=0,\"\",IF(S14=0,0,IF(AB14<=(N14-Q14),AB14,N14-Q14)))","v":29.778572337064386},{"$f":"IF($A14=0,\"\",IF(S14=0,0,IF(AF14<=N14,AF14,N14)))","v":0.57499999999999996},{"$f":"IF(B14=0,\"\",IF(X14=0,0,S14-N14))","v":500},{"$f":"+IF(A14=0,\"\",IF(K14<=$A$1,0,IF(E14=7,$G$1*(1+Datos!$H$24)+Datos!$H$23*(Datos!$H$24)+Datos!$H$24*Datos!$H$42,IF(Cronograma!E14=12,Cronograma!$G$1*(1+Datos!$H$25)+Datos!$H$23*(Datos!$H$25)+Datos!$H$25*Datos!$H$42,Cronograma!$G$1))))","v":530.35357233706441},{"$f":"+IF(S14=\"\",\"\",IF(Varios!$K$5=1,IF(S14=0,0,IF(Varios!$D$4=1,Varios!$D$2,Varios!$D$3)),0))","v":0},{"$f":"+IF(S14=\"\",\"\",IF(S14=0,0,Varios!$F$4))","v":0},{"$f":"IF(S14=\"\",\"\",IF(Varios!$K$15=1,IF(S14=0,0,Datos!$H$27*Varios!$K$12),0))","v":0},{"$f":"+IF(T14=\"\",\"\",S14+T14+U14+V14)","v":530.35357233706441},{"$f":"+IF(W14=\"\",\"\",W14)","v":530.35357233706441},null,{"$f":"IF(J14=\"\",\"\",Datos!$H$18/360*(L14-L13+1)*M13)","v":29.778572337064386},{"$f":"IF(Z14=\"\",\"\",AB13-P13)","v":0},{"$f":"IF(Z14=\"\",\"\",SUM(Z14:AA14))","v":29.778572337064386},null,{"$f":"IF(J14=\"\",\"\",Datos!$H$21*12/360*(L14-L13)*M13)","v":0.57499999999999996},{"$f":"IF(AD14=\"\",\"\",AF13-Q13)","v":0},{"$f":"IF(AD14=\"\",\"\",SUM(AD14:AE14))","v":0.57499999999999996},{"$f":"IF(L14=\"\",\"\",L14-L$12+1)","v":31},{"$f":"+IF(X14=\"\",\"\",W14/((1+$AH$11)^(AG14/365)))","v":499.9999291236569}]
[0,0,null,{"$f":"+IF($D$1=31,IF(F15/4=TRUNC(F15/4),VLOOKUP(E15,Varios!$C$10:$G$21,3,FALSE),VLOOKUP(E15,Varios!$C$10:$G$21,2,FALSE)),IF($D$1>28,IF(F15/4=TRUNC(F15/4),VLOOKUP(E15,Varios!$C$10:$G$21,5,FALSE),VLOOKUP(E15,Varios!$C$10:$G$21,4,FALSE)),$D$1))","v":22},9,2024,"","",null,"",null,null,null,null,null,null,null,null,null,null,null,null,null,null,null,null,null,null,null,null,null,null,null,""]
[0,0,null,{"$f":"+IF($D$1=31,IF(F16/4=TRUNC(F16/4),VLOOKUP(E16,Varios!$C$10:$G$21,3,FALSE),VLOOKUP(E16,Varios!$C$10:$G$21,2,FALSE)),IF($D$1>28,IF(F16/4=TRUNC(F16/4),VLOOKUP(E16,Varios!$C$10:$G$21,5,FALSE),VLOOKUP(E16,Varios!$C$10:$G$21,4,FALSE)),$D$1))","v":22},10,2024,"","",null,"",null,null,null,null,null,null,null,null,null,null,null,null,null,null,null,null,null,null,null,null,null,null,null,""]
[0,0,null,{"$f":"+IF($D$1=31,IF(F17/4=TRUNC(F17/4),VLOOKUP(E17,Varios!$C$10:$G$21,3,FALSE),VLOOKUP(E17,Varios!$C$10:$G$21,2,FALSE)),IF($D$1>28,IF(F17/4=TRUNC(F17/4),VLOOKUP(E17,Varios!$C$10:$G$21,5,FALSE),VLOOKUP(E17,Varios!$C$10:$G$21,4,FALSE)),$D$1))","v":22},11,2024,"","",null,"",null,null,null,null,null,null,null,null,null,null,null,null,null,null,null,null,null,null,null,null,null,null,null,""]
[0,0,null,{"$f":"+IF($D$1=31,IF(F18/4=TRUNC(F18/4),VLOOKUP(E18,Varios!$C$10:$G$21,3,FALSE),VLOOKUP(E18,Varios!$C$10:$G$21,2,FALSE)),IF($D$1>28,IF(F18/4=TRUNC(F18/4),VLOOKUP(E18,Varios!$C$10:$G$21,5,FALSE),VLOOKUP(E18,Varios!$C$10:$G$21,4,FALSE)),$D$1))","v":22},12,2024,"","",null,"",null,null,null,null,null,null,null,null,null,null,null,null,null,null,null,null,null,null,null,null,null,null,null,""]
[0,0,null,{"$f":"+IF($D$1=31,IF(F19/4=TRUNC(F19/4),VLOOKUP(E19,Varios!$C$10:$G$21,3,FALSE),VLOOKUP(E19,Varios!$C$10:$G$21,2,FALSE)),IF($D$1>28,IF(F19/4=TRUNC(F19/4),VLOOKUP(E19,Varios!$C$10:$G$21,5,FALSE),VLOOKUP(E19,Varios!$C$10:$G$21,4,FALSE)),$D$1))","v":22},1,2025,"","",null,"",null,null,null,null,null,null,null,null,null,null,null,null,null,null,null,null,null,null,null,null,null,null,null,""]
[0,0,null,{"$f":"+IF($D$1=31,IF(F20/4=TRUNC(F20/4),VLOOKUP(E20,Varios!$C$10:$G$21,3,FALSE),VLOOKUP(E20,Varios!$C$10:$G$21,2,FALSE)),IF($D$1>28,IF(F20/4=TRUNC(F20/4),VLOOKUP(E20,Varios!$C$10:$G$21,5,FALSE),VLOOKUP(E20,Varios!$C$10:$G$21,4,FALSE)),$D$1))","v":28},2,2025,"","",null,"",null,null,null,null,null,null,null,null,null,null,null,null,null,null,null,null,null,null,null,null,null,null,null,""]
[0,0,null,{"$f":"+IF($D$1=31,IF(F21/4=TRUNC(F21/4),VLOOKUP(E21,Varios!$C$10:$G$21,3,FALSE),VLOOKUP(E21,Varios!$C$10:$G$21,2,FALSE)),IF($D$1>28,IF(F21/4=TRUNC(F21/4),VLOOKUP(E21,Varios!$C$10:$G$21,5,FALSE),VLOOKUP(E21,Varios!$C$10:$G$21,4,FALSE)),$D$1))","v":22},3,2025,"","",null,"",null,null,null,null,null,null,null,null,null,null,null,null,null,null,null,null,null,null,null,null,null,null,null,""]
[0,0,null,{"$f":"+IF($D$1=31,IF(F22/4=TRUNC(F22/4),VLOOKUP(E22,Varios!$C$10:$G$21,3,FALSE),VLOOKUP(E22,Varios!$C$10:$G$21,2,FALSE)),IF($D$1>28,IF(F22/4=TRUNC(F22/4),VLOOKUP(E22,Varios!$C$10:$G$21,5,FALSE),VLOOKUP(E22,Varios!$C$10:$G$21,4,FALSE)),$D$1))","v":22},4,2025,"","",null,"",null,null,null,null,null,null,null,null,null,null,null,null,null,null,null,null,null,null,null,null,null,null,null,""]
[0,0,null,{"$f":"+IF($D$1=31,IF(F23/4=TRUNC(F23/4),VLOOKUP(E23,Varios!$C$10:$G$21,3,FALSE),VLOOKUP(E23,Varios!$C$10:$G$21,2,FALSE)),IF($D$1>28,IF(F23/4=TRUNC(F23/4),VLOOKUP(E23,Varios!$C$10:$G$21,5,FALSE),VLOOKUP(E23,Varios!$C$10:$G$21,4,FALSE)),$D$1))","v":22},5,2025,"","",null,"",null,null,null,null,null,null,null,null,null,null,null,null,null,null,null,null,null,null,null,null,null,null,null,""]
[0,0,null,{"$f":"+IF($D$1=31,IF(F24/4=TRUNC(F24/4),VLOOKUP(E24,Varios!$C$10:$G$21,3,FALSE),VLOOKUP(E24,Varios!$C$10:$G$21,2,FALSE)),IF($D$1>28,IF(F24/4=TRUNC(F24/4),VLOOKUP(E24,Varios!$C$10:$G$21,5,FALSE),VLOOKUP(E24,Varios!$C$10:$G$21,4,FALSE)),$D$1))","v":22},6,2025,"","",null,"",null,null,null,null,null,null,null,null,null,null,null,null,null,null,null,null,null,null,null,null,null,null,null,""]
[0,0,null,{"$f":"+IF($D$1=31,IF(F25/4=TRUNC(F25/4),VLOOKUP(E25,Varios!$C$10:$G$21,3,FALSE),VLOOKUP(E25,Varios!$C$10:$G$21,2,FALSE)),IF($D$1>28,IF(F25/4=TRUNC(F25/4),VLOOKUP(E25,Varios!$C$10:$G$21,5,FALSE),VLOOKUP(E25,Varios!$C$10:$G$21,4,FALSE)),$D$1))","v":22},7,2025,"","",null,"",null,null,null,null,null,null,null,null,null,null,null,null,null,null,null,null,null,null,null,null,null,null,null,""]
[0,0,null,{"$f":"+IF($D$1=31,IF(F26/4=TRUNC(F26/4),VLOOKUP(E26,Varios!$C$10:$G$21,3,FALSE),VLOOKUP(E26,Varios!$C$10:$G$21,2,FALSE)),IF($D$1>28,IF(F26/4=TRUNC(F26/4),VLOOKUP(E26,Varios!$C$10:$G$21,5,FALSE),VLOOKUP(E26,Varios!$C$10:$G$21,4,FALSE)),$D$1))","v":22},8,{"$f":"+IF(E25=E26,F25,IF(E25+1>12,F25+1,F25))","v":2025},"","",null,"",null,null,null,null,null,null,null,null,null,null,null,null,null,null,null,null,null,null,null,null,null,null,null,""]
[0,0,null,{"$f":"+IF($D$1=31,IF(F27/4=TRUNC(F27/4),VLOOKUP(E27,Varios!$C$10:$G$21,3,FALSE),VLOOKUP(E27,Varios!$C$10:$G$21,2,FALSE)),IF($D$1>28,IF(F27/4=TRUNC(F27/4),VLOOKUP(E27,Varios!$C$10:$G$21,5,FALSE),VLOOKUP(E27,Varios!$C$10:$G$21,4,FALSE)),$D$1))","v":22},9,2025,"","",null,"",null,null,null,null,null,null,null,null,null,null,null,null,null,null,null,null,null,null,null,null,null,null,null,""]
[0,0,null,{"$f":"+IF($D$1=31,IF(F28/4=TRUNC(F28/4),VLOOKUP(E28,Varios!$C$10:$G$21,3,FALSE),VLOOKUP(E28,Varios!$C$10:$G$21,2,FALSE)),IF($D$1>28,IF(F28/4=TRUNC(F28/4),VLOOKUP(E28,Varios!$C$10:$G$21,5,FALSE),VLOOKUP(E28,Varios!$C$10:$G$21,4,FALSE)),$D$1))","v":22},10,2025,"","",null,"",null,null,null,null,null,null,null,null,null,null,null,null,null,null,null,null,null,null,null,null,null,null,null,""]
[0,0,null,{"$f":"+IF($D$1=31,IF(F29/4=TRUNC(F29/4),VLOOKUP(E29,Varios!$C$10:$G$21,3,FALSE),VLOOKUP(E29,Varios!$C$10:$G$21,2,FALSE)),IF($D$1>28,IF(F29/4=TRUNC(F29/4),VLOOKUP(E29,Varios!$C$10:$G$21,5,FALSE),VLOOKUP(E29,Varios!$C$10:$G$21,4,FALSE)),$D$1))","v":22},11,2025,"","",null,"",null,null,null,null,null,null,null,null,null,null,null,null,null,null,null,null,null,null,null,null,null,null,null,""]
[0,0,null,{"$f":"+IF($D$1=31,IF(F30/4=TRUNC(F30/4),VLOOKUP(E30,Varios!$C$10:$G$21,3,FALSE),VLOOKUP(E30,Varios!$C$10:$G$21,2,FALSE)),IF($D$1>28,IF(F30/4=TRUNC(F30/4),VLOOKUP(E30,Varios!$C$10:$G$21,5,FALSE),VLOOKUP(E30,Varios!$C$10:$G$21,4,FALSE)),$D$1))","v":22},12,2025,"","",null,"",null,null,null,null,null,null,null,null,null,null,null,null,null,null,null,null,null,null,null,null,null,null,null,""]
{"$rows_left_out":44}
{"sheet":"Varios","index":3,"n_rows":72,"n_cols":16,"rows_kept":72,"cut":false,"hidden":false,"merged":[[83,7,84,7],[63,7,64,7],[63,8,64,8],[77,7,78,7],[79,7,80,7],[77,6,84,6],[67,7,68,7],[72,7,73,7],[81,7,82,7],[7,3,7,4],[7,5,7,6],[8,8,8,11],[75,7,76,7],[75,8,75,9],[67,8,68,8],[72,8,73,8]]}
[null,null,"Moneda","Portes+Seg","Portes","Adm. Pol. End","Desgravamen",null,null,null,"Envío de estado de cuenta"]
[null,1,"Soles",{"$f":"+E2","v":10},10,0,"Individual",1.15E-3,null,1]
[null,2,null,{"$f":"+E3","v":3.8},3.8,0,"Con Retorno",1.4499999999999999E-3,null,2,"Virtual"]
[null,null,1,{"$f":"+C4","v":1},null,{"$f":"+IF(G5=2,IF(C4=1,F2,F3),0)","v":0},"Endosado",0]
[null,null,null,null,null,null,1,null,null,null,2]
[]
[]
[null,null,null,"Para pago 31",null,"Para pago 29 o 30"]
[null,null,"Mes","Año Normal","Año Bisiesto","Año Normal","Año Bisiesto",null,"Seguro optativo de Protección Financiera – SPF"]
[null,null,1,31,{"$f":"+D10","v":31},{"$f":"DAY(Datos!$H$7)","v":22},{"$f":"DAY(Datos!$H$7)","v":22}]
[null,null,2,28,29,28,29,null,null,null,"Tasa",null,"Cuota con SPF","Cuota sin SPF"]
[null,null,3,31,{"$f":"+D12","v":31},{"$f":"DAY(Datos!$H$7)","v":22},{"$f":"DAY(Datos!$H$7)","v":22},null,null,"Con SPF",1.92E-3,null,530.35357233706441,530.35357233706441]
[null,null,4,30,{"$f":"+D13","v":30},{"$f":"DAY(Datos!$H$7)","v":22},{"$f":"DAY(Datos!$H$7)","v":22},null,null,"Sin SPF",0]
[null,null,5,31,31,{"$f":"DAY(Datos!$H$7)","v":22},{"$f":"DAY(Datos!$H$7)","v":22}]
[null,null,6,30,30,{"$f":"DAY(Datos!$H$7)","v":22},{"$f":"DAY(Datos!$H$7)","v":22},null,null,null,2,{"$f":"+IF(K15<>1,\"\",Datos!$H$27*Varios!$K$12)","v":""}]
[null,null,7,31,31,{"$f":"DAY(Datos!$H$7)","v":22},{"$f":"DAY(Datos!$H$7)","v":22}]
[null,null,8,31,31,{"$f":"DAY(Datos!$H$7)","v":22},{"$f":"DAY(Datos!$H$7)","v":22}]
[null,null,9,30,30,{"$f":"DAY(Datos!$H$7)","v":22},{"$f":"DAY(Datos!$H$7)","v":22}]
[null,null,10,31,31,{"$f":"DAY(Datos!$H$7)","v":22},{"$f":"DAY(Datos!$H$7)","v":22}]
[null,null,11,30,30,{"$f":"DAY(Datos!$H$7)","v":22},{"$f":"DAY(Datos!$H$7)","v":22}]
[null,null,12,31,31,{"$f":"DAY(Datos!$H$7)","v":22},{"$f":"DAY(Datos!$H$7)","v":22}]
[]
[null,null,null,null,null,"SOLES","DOLARES"]
[null,{"$f":"+C24&D24","v":"1Ingresos de S/. 700 a S/. 1,199"},1,"Ingresos de S/. 700 a S/. 1,199",null,0.60499999999999998,{"$f":"+F24","v":0.60499999999999998}]
[null,"1Ingresos de S/. 1,200 a S/. 1,799",1,"Ingresos de S/. 1,200 a S/. 1,799",null,0.43,{"$f":"+F25","v":0.43}]
[null,"1Ingresos de S/. 1,800 a S/. 2,599",1,"Ingresos de S/. 1,800 a S/. 2,599",null,0.43,0.43]
[null,"1Ingresos de S/. 2,600 a S/. 3,799",1,"Ingresos de S/. 2,600 a S/. 3,799",null,0.38500000000000001,0.38500000000000001,null,"Segmento",null,1,2,null,null,"Final"]
[null,"1Ingresos de S/. 3,800 a S/. 4,999",1,"Ingresos de S/. 3,800 a S/. 4,999",null,0.36499999999999999,0.36499999999999999,null,null,1,"Ingresos de S/. 700 a S/. 1,199","Ingresos de S/. 700 a S/. 1,199",null,null,{"$f":"IF($I$33=3,\"Otros\",IF(IF($I$33=1,K28,L28)=0,\"\",IF($I$33=1,K28,L28)))","v":"Otros"}]
[null,"1Ingresos de S/. 5,000 a S/. 7,499",1,"Ingresos de S/. 5,000 a S/. 7,499",null,0.36499999999999999,0.36499999999999999,null,null,{"$f":"+J28+1","v":2},"Ingresos de S/. 1,200 a S/. 1,799","Ingresos de S/. 1,200 a S/. 1,799",null,null,{"$f":"IF($I$33=3,\"Otros\",IF(IF($I$33=1,K29,L29)=0,\"\",IF($I$33=1,K29,L29)))","v":"Otros"}]
[null,"1Ingresos de S/. 7,500 a S/. 14,999",1,"Ingresos de S/. 7,500 a S/. 14,999",null,0.35499999999999998,0.35499999999999998,null,"Otros",{"$f":"+J29+1","v":3},"Ingresos de S/. 1,800 a S/. 2,599","Ingresos de S/. 1,800 a S/. 2,599",null,null,"Otros"]
{"$rows_left_out":42}