{"text_format":"1","workbook":"xlsx","n_sheets":4,"sheets":["Datos","Presentación","Cronograma","Varios"],"not_rendered":{"charts":0,"images":3,"macros":1,"external_links":2,"defined_names":13,"comments":0,"pivot_tables":0},"unopened":[],"bounds":{"document_bytes":16777216,"sheet_cells":100000,"rows_first":2000,"rows_last":500,"rows_between":2000,"halvings":0,"cell_chars":16384,"cell_head_chars":4096},"cells_cut":0,"cells_raw":0,"read":"whole","date_system":"1900"}

{"sheet":"Datos","index":0,"n_rows":62,"n_cols":9,"rows_kept":62,"cut":false,"hidden":false,"merged":[]}
[]
[null,null,"Calculadora Crédito Efectivo / Consumo"]
[]
[]
[null,null,"Por favor ingresa los siguientes datos:"]
[]
[null,null,"Fecha de desembolso",null,null,null,null,"2025-10-28","(dd/mm/aaaa)"]
[null,null,"Día de Pago (1-31) ",null,null,null,null,{"$f":"+Varios!D67","v":28}]
[null,null,"Plazo (en Meses)",null,null,null,null,{"$f":"+Varios!G72","v":12}]
[null,null,null,null,null,null,null,0]
[null,null,"Moneda"]
[null,null,"Seguro de Protección Financiera"]
[null,null,"Envío de Estado de Cuenta"]
[null,null,"Tipo Cliente"]
[null,null,"Rango de Ingreso"]
[null,null,"Tasa de Interés Efectiva Anual (En base a 360 días)",null,null,null,null,{"$f":"+IF(Varios!$I$33=3,VLOOKUP(\"Otros\",Varios!$D$24:$G$60,3,FALSE),VLOOKUP(Varios!I33&Varios!O43,Varios!B24:G60,IF(Varios!C4=1,5,6),FALSE))","v":0.72}]
[null,null,"Ingrese Tasa",null,null,null,null,0.72]
[null,null,"Tasa de Interés Nominal Anual",null,null,null,null,{"$f":"+((1+H16)^(1/12)-1)*12","v":0.55476582733539015}]
[null,null,null,null,null,null,null,{"$f":"+(1+H18/12+H22)^12-1","v":0.71999999999999953}]
[null,null,"Tipo de Seguro de Desgravamen"]
{"$rows_left_out":43}
{"sheet":"Presentación","index":1,"n_rows":28,"n_cols":4,"rows_kept":28,"cut":false,"hidden":false,"merged":[[27,0,28,4]]}
[]
[]
["Simulación de Crédito Efectivo / Consumo"]
[]
[]
[]
["Datos del Crédito"]
["Monto del Préstamo",null,{"$f":"+IF(Varios!$C$4=1,\"S/.\",\"US$\")","v":"S/."},{"$f":"Cronograma!M12","v":1000}]
["Plazo de Financiamiento (meses)",null,null,{"$f":"+Datos!H9","v":12}]
["Número de Cuotas Fijas Anuales",null,null,{"$f":"+Datos!H27","v":12}]
["Tasa de Interés Efectiva Anual (en base a 360 días)",null,null,{"$f":"+Datos!H16","v":0.72}]
["Fecha de Desembolso",null,null,{"$f":"+Datos!H7","v":"2025-10-28"}]
["Fecha de Pago",null,null,{"$f":"+CONCATENATE(DAY(Datos!H8),\" \",\"de cada mes\")","v":"28 de cada mes"}]
["Portes Mensuales",null,{"$f":"+IF(Varios!$C$4=1,\"S/.\",\"US$\")","v":"S/."},{"$f":"+Datos!H24","v":0}]
["Tasa de Seguro de Desgravamen",null,null,{"$f":"+Datos!H22","v":0}]
["Seguro de Protección Financiera (SPF) 0.192%",null,null,{"$f":"+IF(Varios!$K$15=1,Varios!$K$12,Varios!$K$13)","v":0}]
[]
["Cuota Mensual",null,{"$f":"+IF(Varios!$C$4=1,\"S/.\",\"US$\")","v":"S/."},{"$f":"+Datos!H47","v":111.00618449776803}]
["Tasa de Costo Efectivo Anual (base 360 días)",null,null,{"$f":"+Datos!H48","v":0.72472229139575584}]
[]
{"$rows_left_out":9}
{"sheet":"Cronograma","index":2,"n_rows":73,"n_cols":35,"rows_kept":73,"cut":false,"hidden":false,"merged":[[2,10,2,23],[9,6,10,6],[9,25,9,27],[9,29,9,31],[8,10,8,12]]}
[{"$f":"+Datos!H10","v":0},{"$f":"+Datos!H9+1+A1","v":13},{"$f":"+((1+Datos!H19)^(0.0833333333333333)-1)*12/365","v":1.519906376261343E-3},{"$f":"+Datos!H8","v":28},{"$f":"SUM(R14:R73)","v":999.99999999999977},{"$f":"+E1-M12","v":0},111.00618449776803,null,null,null,null,null,null,null,null,null,null,null,null,null,null,null,null,null,null,null,null,null,null,null,null,null,null,{"$f":"+AH2-AH10","v":8.3387443510218873E-6}]
[null,null,null,null,null,null,null,null,null,null,"Cronograma",null,null,null,null,null,null,null,null,null,null,null,null,null,null,null,null,null,null,null,null,null,null,{"$f":"+M12","v":1000}]
[null,null,null,null,null,null,null,null,null,null,"NOTA: Todo crédito se encuentra sujeto a la evaluación crediticia del Banco, quien determina el monto y plazo a otorgar. \n            Este documento ha sido emitido en base a la información proporcionada por el cliente y tiene caracter referencial. "]
[null,null,null,null,null,null,null,null,null,null,"Tasa de Interés Efectiva Anual (en base a 360 días):",null,null,null,null,null,{"$f":"+Datos!H16","v":0.72}]
[null,null,null,null,null,null,null,null,null,null,"Tasa de Costo Efectivo Anual (en base a 360 días):",null,null,null,null,null,{"$f":"+AI11","v":0.72472229139575584}]
[null,null,null,null,null,null,null,null,null,null,"Cantidad Total a Pagar:",null,null,null,null,{"$f":"+IF(Varios!C4=1,\"S/.\",\"US$\")","v":"S/."},{"$f":"+SUM(X12:X73)","v":1332.0742139732165}]
[]
[null,null,null,null,null,null,null,null,null,null,null,null,null,"Int + Seg","Int + Seg","Interés","Seguro Desg","Amortización","Cuota","Envío Físico de Estado de Cuenta","Evaluación de Póliza Endosada","Seguro de Protección Financiera","Cuota","Cuota"]
[null,null,null,null,null,null,null,null,null,null,"    Totales a pagar",null,null,null,null,{"$f":"+SUM(P12:P73)","v":332.0742139732165},{"$f":"+SUM(Q12:Q73)","v":0},999.99999999999977,1332.0742139732165,0,0,0,1332.0742139732165,1332.0742139732165]
[null,null,null,null,"Fecha",null,"Int. Acum.","Seg. "," ",null,null,null,null,null,null,null,null,null,null,null,null,null,null,null,null,"Interes x Pagar",null,null,null," Seguros x Pagar",null,null,null,{"$f":"+SUM(AH13:AH73)","v":999.99999166125565}]
[null,null,null,"Dia","Mes","Año",null,"Acum",null,null,"#","Fecha","Saldo","Int + Seg","Int + Seg","Interés","Seguro Desg","Amortización","Cuota","Envío Físico de Estado de Cuenta","Evaluación de Póliza Endosada","Seguro de Protección Financiera","Cuota","Cuota",null,"Calculado","Pdte","Total a Pagar",null,"Calculado","Pdte","Total a Pagar",null,0.73782861027825219,{"$f":"+(1+AH11)^(360/365)-1","v":0.72472229139575584}]
[0,{"$f":"IF(+MONTH(Datos!H7)=12,0,MONTH(Datos!H7))","v":10},null,{"$f":"DAY(Datos!H7)","v":28},{"$f":"+MONTH(Datos!H7)","v":10},{"$f":"YEAR(Datos!H7)","v":2025},null,null,null,null,null,{"$f":"IF(AND(D12<10,E12<10),CONCATENATE(\"0\",D12,\"/\",\"0\",E12,\"/\",F12),IF(AND(D12>9,E12<10),CONCATENATE(D12,\"/\",\"0\",E12,\"/\",F12),IF(AND(D12<10,E12>9),CONCATENATE(\"0\",D12,\"/\",E12,\"/\",F12),IF(AND(D12>9,E12>9),CONCATENATE(D12,\"/\",E12,\"/\",F12)))))","v":"28/10/2025"},{"$f":"Datos!H28","v":1000}]
[{"$f":"+IF(B1>0,A12+1,0)","v":1},{"$f":"+IF(A13=0,0,IF(B12=12,1,B12+1))","v":11},null,{"$f":"+IF($D$1=31,IF(F13/4=TRUNC(F13/4),VLOOKUP(E13,Varios!$C$10:$G$21,3,FALSE),VLOOKUP(E13,Varios!$C$10:$G$21,2,FALSE)),IF($D$1>28,IF(F13/4=TRUNC(F13/4),VLOOKUP(E13,Varios!$C$10:$G$21,5,FALSE),VLOOKUP(E13,Varios!$C$10:$G$21,4,FALSE)),$D$1))","v":28},{"$f":"+IF(NOT(D12>D1),E12,IF(E12+1>12,E12+1-12,E12+1))","v":10},{"$f":"+IF(E12=E13,F12,IF(E12+1>12,F12+1,F12))","v":2025},{"$f":"+P13","v":0},{"$f":"+Q13","v":0},null,{"$f":"+IF(A13=0,\"\",A13)","v":1},null,{"$f":"IF(J13=\"\",\"\",IF(AND(D13<10,E13<10),CONCATENATE(\"0\",D13,\"/\",\"0\",E13,\"/\",F13),IF(AND(D13>9,E13<10),CONCATENATE(D13,\"/\",\"0\",E13,\"/\",F13),IF(AND(D13<10,E13>9),CONCATENATE(\"0\",D13,\"/\",E13,\"/\",F13),IF(AND(D13>9,E13>9),CONCATENATE(D13,\"/\",E13,\"/\",F13))))))","v":"28/10/2025"},{"$f":"IF(B13=0,\"\",M12)","v":1000},{"$f":"IF(A13=0,\"\",IF(AND(Datos!$H$25>0,E13=7),IF(O13<$G$1*Datos!$H$25,O13,$G$1*Datos!$H$25),IF(AND(Datos!$H$26>0,E13=12),IF(O13<$G$1*Datos!$H$26,O13,$G$1*Datos!$H$26),IF((AB13+AF13)<S13,(AB13+AF13),S13))))","v":0},{"$f":"IF(A13=0,\"\",IF(S13=0,0,AB13+AF13))","v":0},{"$f":"IF($A13=0,\"\",IF(S13=0,0,IF(AB13<=(N13-Q13),AB13,N13-Q13)))","v":0},{"$f":"IF($A13=0,\"\",IF(S13=0,0,IF(AF13<=N13,AF13,N13)))","v":0},{"$f":"IF(B13=0,\"\",IF(X13=0,0,S13-N13))","v":0},0,{"$f":"+IF(S13=\"\",\"\",IF(Varios!$K$5=1,IF(S13=0,0,IF(Varios!$D$4=1,Varios!$D$2,Varios!$D$3)),0))","v":0},{"$f":"+IF(S13=\"\",\"\",IF(S13=0,0,Varios!$F$4))","v":0},{"$f":"IF(S13=\"\",\"\",IF(Varios!$K$15=1,IF(S13=0,0,Datos!$H$28*Varios!$K$12),0))","v":0},{"$f":"+IF(T13=\"\",\"\",S13+T13+U13+V13)","v":0},{"$f":"+IF(W13=\"\",\"\",W13)","v":0},null,{"$f":"IF(J13=\"\",\"\",Datos!$H$18/360*(L13-L12+1)*M12)","v":1.5410161870427506},{"$f":"IF(Z13=\"\",\"\",AB12-P12)","v":0},{"$f":"IF(Z13=\"\",\"\",SUM(Z13:AA13))","v":1.5410161870427506},null,{"$f":"IF(J13=\"\",\"\",Datos!$H$22*12/360*(L13-L12)*M12)","v":0},{"$f":"IF(AD13=\"\",\"\",AF12-Q12)","v":0},{"$f":"IF(AD13=\"\",\"\",SUM(AD13:AE13))","v":0},{"$f":"IF(L13=\"\",\"\",L13-L$12+1)","v":1},{"$f":"+W13/((1+$AH$11)^(AG13/365))","v":0}]
[{"$f":"+IF(OR(A13=$B$1,A13=0),0,A13+1)","v":2},12,null,{"$f":"+IF($D$1=31,IF(F14/4=TRUNC(F14/4),VLOOKUP(E14,Varios!$C$10:$G$21,3,FALSE),VLOOKUP(E14,Varios!$C$10:$G$21,2,FALSE)),IF($D$1>28,IF(F14/4=TRUNC(F14/4),VLOOKUP(E14,Varios!$C$10:$G$21,5,FALSE),VLOOKUP(E14,Varios!$C$10:$G$21,4,FALSE)),$D$1))","v":28},{"$f":"IF(L13-L12>=15,E13,IF(E13=12,1,E13+1))","v":11},{"$f":"IF(L13-L12>=15,F13,IF(E13=E14,F13,IF(E13+1>12,F13+1,F13)))","v":2025},{"$f":"+IF(P14=\"\",\"\",G13+P14)","v":49.312517985368018},{"$f":"+IF(Q14=\"\",\"\",H13+Q14)","v":0},null,{"$f":"+IF(A14=0,\"\",A14)","v":2},{"$f":"+IF(J14=\"\",\"\",J14-1)","v":1},{"$f":"IF(J14=\"\",\"\",IF(AND(D14<10,E14<10),CONCATENATE(\"0\",D14,\"/\",\"0\",E14,\"/\",F14),IF(AND(D14>9,E14<10),CONCATENATE(D14,\"/\",\"0\",E14,\"/\",F14),IF(AND(D14<10,E14>9),CONCATENATE(\"0\",D14,\"/\",E14,\"/\",F14),IF(AND(D14>9,E14>9),CONCATENATE(D14,\"/\",E14,\"/\",F14))))))","v":"28/11/2025"},{"$f":"IF(B14=0,\"\",IF($A$1+1=J14,M13+G14+H14,IF($A$1+1<J14,M13-R14,M13)))","v":938.3063334876},{"$f":"IF(A14=0,\"\",IF(AND(Datos!$H$25>0,E14=7),IF(O14<$G$1*Datos!$H$25,O14,$G$1*Datos!$H$25),IF(AND(Datos!$H$26>0,E14=12),IF(O14<$G$1*Datos!$H$26,O14,$G$1*Datos!$H$26),IF((AB14+AF14)<S14,(AB14+AF14),S14))))","v":49.312517985368018},{"$f":"IF(A14=0,\"\",IF(S14=0,0,AB14+AF14))","v":49.312517985368018},49.312517985368018,{"$f":"IF($A14=0,\"\",IF(S14=0,0,IF(AF14<=N14,AF14,N14)))","v":0},{"$f":"IF(B14=0,\"\",IF(X14=0,0,S14-N14))","v":61.693666512400014},{"$f":"+IF(A14=0,\"\",IF(K14<=$A$1,0,IF(E14=7,$G$1*(1+Datos!$H$25)+Datos!$H$24*(Datos!$H$25)+Datos!$H$25*Datos!$H$43,IF(Cronograma!E14=12,Cronograma!$G$1*(1+Datos!$H$26)+Datos!$H$24*(Datos!$H$26)+Datos!$H$26*Datos!$H$43,Cronograma!$G$1))))","v":111.00618449776803},{"$f":"+IF(S14=\"\",\"\",IF(Varios!$K$5=1,IF(S14=0,0,IF(Varios!$D$4=1,Varios!$D$2,Varios!$D$3)),0))","v":0},{"$f":"+IF(S14=\"\",\"\",IF(S14=0,0,Varios!$F$4))","v":0},{"$f":"IF(S14=\"\",\"\",IF(Varios!$K$15=1,IF(S14=0,0,Datos!$H$28*Varios!$K$12),0))","v":0},{"$f":"+IF(T14=\"\",\"\",S14+T14+U14+V14)","v":111.00618449776803},{"$f":"+IF(W14=\"\",\"\",W14)","v":111.00618449776803},null,{"$f":"IF(J14=\"\",\"\",Datos!$H$18/360*(L14-L13)*M13)","v":47.771501798325268},1.5410161870427506,{"$f":"IF(Z14=\"\",\"\",SUM(Z14:AA14))","v":49.312517985368018},null,{"$f":"IF(J14=\"\",\"\",Datos!$H$22*12/360*(L14-L13)*M13)","v":0},0,{"$f":"IF(AD14=\"\",\"\",SUM(AD14:AE14))","v":0},{"$f":"IF(L14=\"\",\"\",L14-L$12)","v":31},{"$f":"+IF(X14=\"\",\"\",W14/((1+$AH$11)^(AG14/365)))","v":105.91635438416391}]
[3,1,null,{"$f":"+IF($D$1=31,IF(F15/4=TRUNC(F15/4),VLOOKUP(E15,Varios!$C$10:$G$21,3,FALSE),VLOOKUP(E15,Varios!$C$10:$G$21,2,FALSE)),IF($D$1>28,IF(F15/4=TRUNC(F15/4),VLOOKUP(E15,Varios!$C$10:$G$21,5,FALSE),VLOOKUP(E15,Varios!$C$10:$G$21,4,FALSE)),$D$1))","v":28},{"$f":"IF(E14=12,1,E14+1)","v":12},{"$f":"+IF(E14=E15,F14,IF(E14+1>12,F14+1,F14))","v":2025},92.690875434641754,0,null,3,{"$f":"+IF(J15=\"\",\"\",J15-1)","v":2},"28/12/2025",870.67850643910572,{"$f":"IF(A15=0,\"\",IF(AND(Datos!$H$25>0,E15=7),IF(O15<$G$1*Datos!$H$25,O15,$G$1*Datos!$H$25),IF(AND(Datos!$H$26>0,E15=12),IF(O15<$G$1*Datos!$H$26,O15,$G$1*Datos!$H$26),IF((AB15+AF15)<S15,(AB15+AF15),S15))))","v":43.378357449273743},43.378357449273743,43.378357449273743,{"$f":"IF($A15=0,\"\",IF(S15=0,0,IF(AF15<=N15,AF15,N15)))","v":0},{"$f":"IF(B15=0,\"\",IF(X15=0,0,S15-N15))","v":67.627827048494282},{"$f":"+IF(A15=0,\"\",IF(K15<=$A$1,0,IF(E15=7,$G$1*(1+Datos!$H$25)+Datos!$H$24*(Datos!$H$25)+Datos!$H$25*Datos!$H$43,IF(Cronograma!E15=12,Cronograma!$G$1*(1+Datos!$H$26)+Datos!$H$24*(Datos!$H$26)+Datos!$H$26*Datos!$H$43,Cronograma!$G$1))))","v":111.00618449776803},{"$f":"+IF(S15=\"\",\"\",IF(Varios!$K$5=1,IF(S15=0,0,IF(Varios!$D$4=1,Varios!$D$2,Varios!$D$3)),0))","v":0},{"$f":"+IF(S15=\"\",\"\",IF(S15=0,0,Varios!$F$4))","v":0},{"$f":"IF(S15=\"\",\"\",IF(Varios!$K$15=1,IF(S15=0,0,Datos!$H$28*Varios!$K$12),0))","v":0},111.00618449776803,{"$f":"+IF(W15=\"\",\"\",W15)","v":111.00618449776803},null,{"$f":"IF(J15=\"\",\"\",Datos!$H$18/360*(L15-L14)*M14)","v":43.378357449273743},0,{"$f":"IF(Z15=\"\",\"\",SUM(Z15:AA15))","v":43.378357449273743},null,{"$f":"IF(J15=\"\",\"\",Datos!$H$22*12/360*(L15-L14)*M14)","v":0},0,{"$f":"IF(AD15=\"\",\"\",SUM(AD15:AE15))","v":0},{"$f":"IF(L15=\"\",\"\",L15-L$12)","v":61},101.21302989133122]
[4,2,null,{"$f":"+IF($D$1=31,IF(F16/4=TRUNC(F16/4),VLOOKUP(E16,Varios!$C$10:$G$21,3,FALSE),VLOOKUP(E16,Varios!$C$10:$G$21,2,FALSE)),IF($D$1>28,IF(F16/4=TRUNC(F16/4),VLOOKUP(E16,Varios!$C$10:$G$21,5,FALSE),VLOOKUP(E16,Varios!$C$10:$G$21,4,FALSE)),$D$1))","v":28},1,2026,134.28449527076066,0,null,4,3,"28/01/2026",801.26594177745665,{"$f":"IF(A16=0,\"\",IF(AND(Datos!$H$25>0,E16=7),IF(O16<$G$1*Datos!$H$25,O16,$G$1*Datos!$H$25),IF(AND(Datos!$H$26>0,E16=12),IF(O16<$G$1*Datos!$H$26,O16,$G$1*Datos!$H$26),IF((AB16+AF16)<S16,(AB16+AF16),S16))))","v":41.593619836118897},41.593619836118897,41.593619836118897,0,69.412564661649128,{"$f":"+IF(A16=0,\"\",IF(K16<=$A$1,0,IF(E16=7,$G$1*(1+Datos!$H$25)+Datos!$H$24*(Datos!$H$25)+Datos!$H$25*Datos!$H$43,IF(Cronograma!E16=12,Cronograma!$G$1*(1+Datos!$H$26)+Datos!$H$24*(Datos!$H$26)+Datos!$H$26*Datos!$H$43,Cronograma!$G$1))))","v":111.00618449776803},{"$f":"+IF(S16=\"\",\"\",IF(Varios!$K$5=1,IF(S16=0,0,IF(Varios!$D$4=1,Varios!$D$2,Varios!$D$3)),0))","v":0},{"$f":"+IF(S16=\"\",\"\",IF(S16=0,0,Varios!$F$4))","v":0},{"$f":"IF(S16=\"\",\"\",IF(Varios!$K$15=1,IF(S16=0,0,Datos!$H$28*Varios!$K$12),0))","v":0},111.00618449776803,{"$f":"+IF(W16=\"\",\"\",W16)","v":111.00618449776803},null,{"$f":"IF(J16=\"\",\"\",Datos!$H$18/360*(L16-L15)*M15)","v":41.593619836118897},0,41.593619836118897,null,{"$f":"IF(J16=\"\",\"\",Datos!$H$22*12/360*(L16-L15)*M15)","v":0},0,0,92,96.572233256794433]
[5,3,null,{"$f":"+IF($D$1=31,IF(F17/4=TRUNC(F17/4),VLOOKUP(E17,Varios!$C$10:$G$21,3,FALSE),VLOOKUP(E17,Varios!$C$10:$G$21,2,FALSE)),IF($D$1>28,IF(F17/4=TRUNC(F17/4),VLOOKUP(E17,Varios!$C$10:$G$21,5,FALSE),VLOOKUP(E17,Varios!$C$10:$G$21,4,FALSE)),$D$1))","v":28},2,2026,172.56217264931922,0,null,5,4,"28/02/2026",728.53743465824721,{"$f":"IF(A17=0,\"\",IF(AND(Datos!$H$25>0,E17=7),IF(O17<$G$1*Datos!$H$25,O17,$G$1*Datos!$H$25),IF(AND(Datos!$H$26>0,E17=12),IF(O17<$G$1*Datos!$H$26,O17,$G$1*Datos!$H$26),IF((AB17+AF17)<S17,(AB17+AF17),S17))))","v":38.277677378558558},38.277677378558558,38.277677378558558,0,72.728507119209468,{"$f":"+IF(A17=0,\"\",IF(K17<=$A$1,0,IF(E17=7,$G$1*(1+Datos!$H$25)+Datos!$H$24*(Datos!$H$25)+Datos!$H$25*Datos!$H$43,IF(Cronograma!E17=12,Cronograma!$G$1*(1+Datos!$H$26)+Datos!$H$24*(Datos!$H$26)+Datos!$H$26*Datos!$H$43,Cronograma!$G$1))))","v":111.00618449776803},{"$f":"+IF(S17=\"\",\"\",IF(Varios!$K$5=1,IF(S17=0,0,IF(Varios!$D$4=1,Varios!$D$2,Varios!$D$3)),0))","v":0},{"$f":"+IF(S17=\"\",\"\",IF(S17=0,0,Varios!$F$4))","v":0},{"$f":"IF(S17=\"\",\"\",IF(Varios!$K$15=1,IF(S17=0,0,Datos!$H$28*Varios!$K$12),0))","v":0},111.00618449776803,111.00618449776803,null,{"$f":"IF(J17=\"\",\"\",Datos!$H$18/360*(L17-L16)*M16)","v":38.277677378558558},0,38.277677378558558,null,{"$f":"IF(J17=\"\",\"\",Datos!$H$22*12/360*(L17-L16)*M16)","v":0},0,0,123,92.144225365231279]
[6,4,null,{"$f":"+IF($D$1=31,IF(F18/4=TRUNC(F18/4),VLOOKUP(E18,Varios!$C$10:$G$21,3,FALSE),VLOOKUP(E18,Varios!$C$10:$G$21,2,FALSE)),IF($D$1>28,IF(F18/4=TRUNC(F18/4),VLOOKUP(E18,Varios!$C$10:$G$21,5,FALSE),VLOOKUP(E18,Varios!$C$10:$G$21,4,FALSE)),$D$1))","v":28},3,2026,203.99743608021808,0,null,6,5,"28/03/2026",648.96651359137809,{"$f":"IF(A18=0,\"\",IF(AND(Datos!$H$25>0,E18=7),IF(O18<$G$1*Datos!$H$25,O18,$G$1*Datos!$H$25),IF(AND(Datos!$H$26>0,E18=12),IF(O18<$G$1*Datos!$H$26,O18,$G$1*Datos!$H$26),IF((AB18+AF18)<S18,(AB18+AF18),S18))))","v":31.435263430898857},31.435263430898857,31.435263430898857,0,79.570921066869175,{"$f":"+IF(A18=0,\"\",IF(K18<=$A$1,0,IF(E18=7,$G$1*(1+Datos!$H$25)+Datos!$H$24*(Datos!$H$25)+Datos!$H$25*Datos!$H$43,IF(Cronograma!E18=12,Cronograma!$G$1*(1+Datos!$H$26)+Datos!$H$24*(Datos!$H$26)+Datos!$H$26*Datos!$H$43,Cronograma!$G$1))))","v":111.00618449776803},{"$f":"+IF(S18=\"\",\"\",IF(Varios!$K$5=1,IF(S18=0,0,IF(Varios!$D$4=1,Varios!$D$2,Varios!$D$3)),0))","v":0},{"$f":"+IF(S18=\"\",\"\",IF(S18=0,0,Varios!$F$4))","v":0},{"$f":"IF(S18=\"\",\"\",IF(Varios!$K$15=1,IF(S18=0,0,Datos!$H$28*Varios!$K$12),0))","v":0},111.00618449776803,111.00618449776803,null,{"$f":"IF(J18=\"\",\"\",Datos!$H$18/360*(L18-L17)*M17)","v":31.435263430898857},0,31.435263430898857,null,{"$f":"IF(J18=\"\",\"\",Datos!$H$22*12/360*(L18-L17)*M17)","v":0},0,0,151,88.319506128878331]
[7,5,null,{"$f":"+IF($D$1=31,IF(F19/4=TRUNC(F19/4),VLOOKUP(E19,Varios!$C$10:$G$21,3,FALSE),VLOOKUP(E19,Varios!$C$10:$G$21,2,FALSE)),IF($D$1>28,IF(F19/4=TRUNC(F19/4),VLOOKUP(E19,Varios!$C$10:$G$21,5,FALSE),VLOOKUP(E19,Varios!$C$10:$G$21,4,FALSE)),$D$1))","v":28},4,2026,234.99954105130149,0,null,7,6,"28/04/2026",568.96243406469341,{"$f":"IF(A19=0,\"\",IF(AND(Datos!$H$25>0,E19=7),IF(O19<$G$1*Datos!$H$25,O19,$G$1*Datos!$H$25),IF(AND(Datos!$H$26>0,E19=12),IF(O19<$G$1*Datos!$H$26,O19,$G$1*Datos!$H$26),IF((AB19+AF19)<S19,(AB19+AF19),S19))))","v":31.002104971083398},31.002104971083398,31.002104971083398,0,80.004079526684635,{"$f":"+IF(A19=0,\"\",IF(K19<=$A$1,0,IF(E19=7,$G$1*(1+Datos!$H$25)+Datos!$H$24*(Datos!$H$25)+Datos!$H$25*Datos!$H$43,IF(Cronograma!E19=12,Cronograma!$G$1*(1+Datos!$H$26)+Datos!$H$24*(Datos!$H$26)+Datos!$H$26*Datos!$H$43,Cronograma!$G$1))))","v":111.00618449776803},{"$f":"+IF(S19=\"\",\"\",IF(Varios!$K$5=1,IF(S19=0,0,IF(Varios!$D$4=1,Varios!$D$2,Varios!$D$3)),0))","v":0},{"$f":"+IF(S19=\"\",\"\",IF(S19=0,0,Varios!$F$4))","v":0},{"$f":"IF(S19=\"\",\"\",IF(Varios!$K$15=1,IF(S19=0,0,Datos!$H$28*Varios!$K$12),0))","v":0},111.00618449776803,111.00618449776803,null,{"$f":"IF(J19=\"\",\"\",Datos!$H$18/360*(L19-L18)*M18)","v":31.002104971083398},0,31.002104971083398,null,{"$f":"IF(J19=\"\",\"\",Datos!$H$22*12/360*(L19-L18)*M18)","v":0},0,0,182,84.269900388916639]
[8,6,null,{"$f":"+IF($D$1=31,IF(F20/4=TRUNC(F20/4),VLOOKUP(E20,Varios!$C$10:$G$21,3,FALSE),VLOOKUP(E20,Varios!$C$10:$G$21,2,FALSE)),IF($D$1>28,IF(F20/4=TRUNC(F20/4),VLOOKUP(E20,Varios!$C$10:$G$21,5,FALSE),VLOOKUP(E20,Varios!$C$10:$G$21,4,FALSE)),$D$1))","v":28},5,2026,261.30295067268958,0,null,8,7,"28/05/2026",484.25965918831344,{"$f":"IF(A20=0,\"\",IF(AND(Datos!$H$25>0,E20=7),IF(O20<$G$1*Datos!$H$25,O20,$G$1*Datos!$H$25),IF(AND(Datos!$H$26>0,E20=12),IF(O20<$G$1*Datos!$H$26,O20,$G$1*Datos!$H$26),IF((AB20+AF20)<S20,(AB20+AF20),S20))))","v":26.303409621388084},26.303409621388084,26.303409621388084,0,84.702774876379948,{"$f":"+IF(A20=0,\"\",IF(K20<=$A$1,0,IF(E20=7,$G$1*(1+Datos!$H$25)+Datos!$H$24*(Datos!$H$25)+Datos!$H$25*Datos!$H$43,IF(Cronograma!E20=12,Cronograma!$G$1*(1+Datos!$H$26)+Datos!$H$24*(Datos!$H$26)+Datos!$H$26*Datos!$H$43,Cronograma!$G$1))))","v":111.00618449776803},{"$f":"+IF(S20=\"\",\"\",IF(Varios!$K$5=1,IF(S20=0,0,IF(Varios!$D$4=1,Varios!$D$2,Varios!$D$3)),0))","v":0},{"$f":"+IF(S20=\"\",\"\",IF(S20=0,0,Varios!$F$4))","v":0},{"$f":"IF(S20=\"\",\"\",IF(Varios!$K$15=1,IF(S20=0,0,Datos!$H$28*Varios!$K$12),0))","v":0},111.00618449776803,111.00618449776803,null,{"$f":"IF(J20=\"\",\"\",Datos!$H$18/360*(L20-L19)*M19)","v":26.303409621388084},0,26.303409621388084,null,{"$f":"IF(J20=\"\",\"\",Datos!$H$22*12/360*(L20-L19)*M19)","v":0},0,0,212,80.527808916714093]
{"$rows_left_out":54}
{"sheet":"Varios","index":3,"n_rows":72,"n_cols":16,"rows_kept":72,"cut":false,"hidden":false,"merged":[[63,7,64,7],[63,8,64,8],[77,7,78,7],[79,7,80,7],[7,3,7,4],[7,5,7,6],[8,8,8,11],[75,7,76,7],[75,8,75,9],[67,8,68,8],[72,8,73,8],[77,6,84,6],[67,7,68,7],[72,7,73,7],[81,7,82,7],[83,7,84,7]]}
[null,null,"Moneda","Portes+Seg","Portes","Adm. Pol. End","Desgravamen",null,null,null,"Envío de estado de cuenta"]
[null,1,"Soles",{"$f":"+E2","v":10},10,0,"Individual",1.15E-3,null,1]
[null,2,null,{"$f":"+E3","v":3.8},3.8,0,"Con Retorno",1.4499999999999999E-3,null,2,"Virtual"]
[null,null,1,{"$f":"+C4","v":1},null,{"$f":"+IF(G5=2,IF(C4=1,F2,F3),0)","v":0},"Endosado",0]
[null,null,null,null,null,null,1,null,null,null,2]
[]
[]
[null,null,null,"Para pago 31",null,"Para pago 29 o 30"]
[null,null,"Mes","Año Normal","Año Bisiesto","Año Normal","Año Bisiesto",null,"Seguro optativo de Protección Financiera – SPF"]
[null,null,1,31,{"$f":"+D10","v":31},{"$f":"+Datos!$H$8","v":28},{"$f":"+Datos!$H$8","v":28}]
[null,null,2,28,29,28,29,null,null,null,"Tasa",null,"Cuota con SPF","Cuota sin SPF"]
[null,null,3,31,{"$f":"+D12","v":31},{"$f":"+Datos!$H$8","v":28},{"$f":"+Datos!$H$8","v":28},null,null,"Con SPF",1.92E-3,null,111.00618449776803,111.00618449776803]
[null,null,4,30,{"$f":"+D13","v":30},{"$f":"+Datos!$H$8","v":28},{"$f":"+Datos!$H$8","v":28},null,null,"Sin SPF",0]
[null,null,5,31,31,{"$f":"+Datos!$H$8","v":28},{"$f":"+Datos!$H$8","v":28}]
[null,null,6,30,30,{"$f":"+Datos!$H$8","v":28},{"$f":"+Datos!$H$8","v":28},null,null,null,2,{"$f":"+IF(K15<>1,\"\",Datos!$H$28*Varios!$K$12)","v":""}]
[null,null,7,31,31,{"$f":"+Datos!$H$8","v":28},{"$f":"+Datos!$H$8","v":28}]
[null,null,8,31,31,{"$f":"+Datos!$H$8","v":28},{"$f":"+Datos!$H$8","v":28}]
[null,null,9,30,30,{"$f":"+Datos!$H$8","v":28},{"$f":"+Datos!$H$8","v":28}]
[null,null,10,31,31,{"$f":"+Datos!$H$8","v":28},{"$f":"+Datos!$H$8","v":28}]
[null,null,11,30,30,{"$f":"+Datos!$H$8","v":28},{"$f":"+Datos!$H$8","v":28}]
{"$rows_left_out":52}